FailedConsole Output

Skipping 46 KB.. Full Log
avex32/workspace/gluegen/label/linux-x86_32-nvidia/build/gensrc/java/com/jogamp/gluegen/cgram/StdCParser.g:1353:     between alt 1 and exit branch of block
    [antlr] /home/jogamp/JogAmpSlavex32/workspace/gluegen/label/linux-x86_32-nvidia/build/gensrc/java/com/jogamp/gluegen/cgram/StdCParser.g:1353:34: warning:lexical nondeterminism between alts 1 and 2 of block upon
    [antlr] /home/jogamp/JogAmpSlavex32/workspace/gluegen/label/linux-x86_32-nvidia/build/gensrc/java/com/jogamp/gluegen/cgram/StdCParser.g:1353:34:     k==1:'E','e'
    [antlr] /home/jogamp/JogAmpSlavex32/workspace/gluegen/label/linux-x86_32-nvidia/build/gensrc/java/com/jogamp/gluegen/cgram/StdCParser.g:1353:34:     k==2:'+','-','0'..'9'
    [antlr] /home/jogamp/JogAmpSlavex32/workspace/gluegen/label/linux-x86_32-nvidia/build/gensrc/java/com/jogamp/gluegen/cgram/StdCParser.g:1353:34:     k==3:<end-of-token>,'\u0000'..'\u00ff'
    [antlr] /home/jogamp/JogAmpSlavex32/workspace/gluegen/label/linux-x86_32-nvidia/build/gensrc/java/com/jogamp/gluegen/cgram/StdCParser.g:1356:17: warning:lexical nondeterminism between alts 1 and 3 of block upon
    [antlr] /home/jogamp/JogAmpSlavex32/workspace/gluegen/label/linux-x86_32-nvidia/build/gensrc/java/com/jogamp/gluegen/cgram/StdCParser.g:1356:17:     k==1:'F','f'
    [antlr] /home/jogamp/JogAmpSlavex32/workspace/gluegen/label/linux-x86_32-nvidia/build/gensrc/java/com/jogamp/gluegen/cgram/StdCParser.g:1356:17:     k==2:<end-of-token>,'\u0000'..'\u00ff'
    [antlr] /home/jogamp/JogAmpSlavex32/workspace/gluegen/label/linux-x86_32-nvidia/build/gensrc/java/com/jogamp/gluegen/cgram/StdCParser.g:1356:17:     k==3:<end-of-token>,'\u0000'..'\u00ff'
    [antlr] /home/jogamp/JogAmpSlavex32/workspace/gluegen/label/linux-x86_32-nvidia/build/gensrc/java/com/jogamp/gluegen/cgram/StdCParser.g:1356:17: warning:lexical nondeterminism between alts 2 and 3 of block upon
    [antlr] /home/jogamp/JogAmpSlavex32/workspace/gluegen/label/linux-x86_32-nvidia/build/gensrc/java/com/jogamp/gluegen/cgram/StdCParser.g:1356:17:     k==1:'L','l'
    [antlr] /home/jogamp/JogAmpSlavex32/workspace/gluegen/label/linux-x86_32-nvidia/build/gensrc/java/com/jogamp/gluegen/cgram/StdCParser.g:1356:17:     k==2:<end-of-token>,'\u0000'..'\u00ff'
    [antlr] /home/jogamp/JogAmpSlavex32/workspace/gluegen/label/linux-x86_32-nvidia/build/gensrc/java/com/jogamp/gluegen/cgram/StdCParser.g:1356:17:     k==3:<end-of-token>,'\u0000'..'\u00ff'
    [antlr] /home/jogamp/JogAmpSlavex32/workspace/gluegen/label/linux-x86_32-nvidia/build/gensrc/java/com/jogamp/gluegen/cgram/StdCParser.g:1363:17: warning:lexical nondeterminism between alts 1 and 2 of block upon
    [antlr] /home/jogamp/JogAmpSlavex32/workspace/gluegen/label/linux-x86_32-nvidia/build/gensrc/java/com/jogamp/gluegen/cgram/StdCParser.g:1363:17:     k==1:'0'..'9'
    [antlr] /home/jogamp/JogAmpSlavex32/workspace/gluegen/label/linux-x86_32-nvidia/build/gensrc/java/com/jogamp/gluegen/cgram/StdCParser.g:1363:17:     k==2:<end-of-token>,'\u0000'..'\u00ff'
    [antlr] /home/jogamp/JogAmpSlavex32/workspace/gluegen/label/linux-x86_32-nvidia/build/gensrc/java/com/jogamp/gluegen/cgram/StdCParser.g:1363:17:     k==3:<end-of-token>,'\u0000'..'\u00ff'
    [antlr] /home/jogamp/JogAmpSlavex32/workspace/gluegen/label/linux-x86_32-nvidia/build/gensrc/java/com/jogamp/gluegen/cgram/StdCParser.g:1363: warning:lexical nondeterminism upon
    [antlr] /home/jogamp/JogAmpSlavex32/workspace/gluegen/label/linux-x86_32-nvidia/build/gensrc/java/com/jogamp/gluegen/cgram/StdCParser.g:1363:     k==1:'0'..'9'
    [antlr] /home/jogamp/JogAmpSlavex32/workspace/gluegen/label/linux-x86_32-nvidia/build/gensrc/java/com/jogamp/gluegen/cgram/StdCParser.g:1363:     k==2:<end-of-token>,'\u0000'..'\u00ff'
    [antlr] /home/jogamp/JogAmpSlavex32/workspace/gluegen/label/linux-x86_32-nvidia/build/gensrc/java/com/jogamp/gluegen/cgram/StdCParser.g:1363:     k==3:<end-of-token>,'\u0000'..'\u00ff'
    [antlr] /home/jogamp/JogAmpSlavex32/workspace/gluegen/label/linux-x86_32-nvidia/build/gensrc/java/com/jogamp/gluegen/cgram/StdCParser.g:1363:     between alt 1 and exit branch of block
    [antlr] /home/jogamp/JogAmpSlavex32/workspace/gluegen/label/linux-x86_32-nvidia/build/gensrc/java/com/jogamp/gluegen/cgram/StdCParser.g:1363:30: warning:lexical nondeterminism between alts 1 and 2 of block upon
    [antlr] /home/jogamp/JogAmpSlavex32/workspace/gluegen/label/linux-x86_32-nvidia/build/gensrc/java/com/jogamp/gluegen/cgram/StdCParser.g:1363:30:     k==1:'E','e'
    [antlr] /home/jogamp/JogAmpSlavex32/workspace/gluegen/label/linux-x86_32-nvidia/build/gensrc/java/com/jogamp/gluegen/cgram/StdCParser.g:1363:30:     k==2:'+','-','0'..'9'
    [antlr] /home/jogamp/JogAmpSlavex32/workspace/gluegen/label/linux-x86_32-nvidia/build/gensrc/java/com/jogamp/gluegen/cgram/StdCParser.g:1363:30:     k==3:<end-of-token>,'\u0000'..'\u00ff'
    [antlr] /home/jogamp/JogAmpSlavex32/workspace/gluegen/label/linux-x86_32-nvidia/build/gensrc/java/com/jogamp/gluegen/cgram/StdCParser.g:1365:19: warning:lexical nondeterminism between alts 1 and 3 of block upon
    [antlr] /home/jogamp/JogAmpSlavex32/workspace/gluegen/label/linux-x86_32-nvidia/build/gensrc/java/com/jogamp/gluegen/cgram/StdCParser.g:1365:19:     k==1:'F','f'
    [antlr] /home/jogamp/JogAmpSlavex32/workspace/gluegen/label/linux-x86_32-nvidia/build/gensrc/java/com/jogamp/gluegen/cgram/StdCParser.g:1365:19:     k==2:<end-of-token>,'\u0000'..'\u00ff'
    [antlr] /home/jogamp/JogAmpSlavex32/workspace/gluegen/label/linux-x86_32-nvidia/build/gensrc/java/com/jogamp/gluegen/cgram/StdCParser.g:1365:19:     k==3:<end-of-token>,'\u0000'..'\u00ff'
    [antlr] /home/jogamp/JogAmpSlavex32/workspace/gluegen/label/linux-x86_32-nvidia/build/gensrc/java/com/jogamp/gluegen/cgram/StdCParser.g:1365:19: warning:lexical nondeterminism between alts 2 and 3 of block upon
    [antlr] /home/jogamp/JogAmpSlavex32/workspace/gluegen/label/linux-x86_32-nvidia/build/gensrc/java/com/jogamp/gluegen/cgram/StdCParser.g:1365:19:     k==1:'L','l'
    [antlr] /home/jogamp/JogAmpSlavex32/workspace/gluegen/label/linux-x86_32-nvidia/build/gensrc/java/com/jogamp/gluegen/cgram/StdCParser.g:1365:19:     k==2:<end-of-token>,'\u0000'..'\u00ff'
    [antlr] /home/jogamp/JogAmpSlavex32/workspace/gluegen/label/linux-x86_32-nvidia/build/gensrc/java/com/jogamp/gluegen/cgram/StdCParser.g:1365:19:     k==3:<end-of-token>,'\u0000'..'\u00ff'
    [antlr] /home/jogamp/JogAmpSlavex32/workspace/gluegen/label/linux-x86_32-nvidia/build/gensrc/java/com/jogamp/gluegen/cgram/StdCParser.g:1370: warning:lexical nondeterminism upon
    [antlr] /home/jogamp/JogAmpSlavex32/workspace/gluegen/label/linux-x86_32-nvidia/build/gensrc/java/com/jogamp/gluegen/cgram/StdCParser.g:1370:     k==1:'0'..'7'
    [antlr] /home/jogamp/JogAmpSlavex32/workspace/gluegen/label/linux-x86_32-nvidia/build/gensrc/java/com/jogamp/gluegen/cgram/StdCParser.g:1370:     k==2:<end-of-token>,'\u0000'..'\u00ff'
    [antlr] /home/jogamp/JogAmpSlavex32/workspace/gluegen/label/linux-x86_32-nvidia/build/gensrc/java/com/jogamp/gluegen/cgram/StdCParser.g:1370:     k==3:<end-of-token>,'\u0000'..'\u00ff'
    [antlr] /home/jogamp/JogAmpSlavex32/workspace/gluegen/label/linux-x86_32-nvidia/build/gensrc/java/com/jogamp/gluegen/cgram/StdCParser.g:1370:     between alt 1 and exit branch of block
    [antlr] /home/jogamp/JogAmpSlavex32/workspace/gluegen/label/linux-x86_32-nvidia/build/gensrc/java/com/jogamp/gluegen/cgram/StdCParser.g:1371:17: warning:lexical nondeterminism between alts 1 and 3 of block upon
    [antlr] /home/jogamp/JogAmpSlavex32/workspace/gluegen/label/linux-x86_32-nvidia/build/gensrc/java/com/jogamp/gluegen/cgram/StdCParser.g:1371:17:     k==1:'L','l'
    [antlr] /home/jogamp/JogAmpSlavex32/workspace/gluegen/label/linux-x86_32-nvidia/build/gensrc/java/com/jogamp/gluegen/cgram/StdCParser.g:1371:17:     k==2:<end-of-token>,'\u0000'..'\u00ff'
    [antlr] /home/jogamp/JogAmpSlavex32/workspace/gluegen/label/linux-x86_32-nvidia/build/gensrc/java/com/jogamp/gluegen/cgram/StdCParser.g:1371:17:     k==3:<end-of-token>,'\u0000'..'\u00ff'
    [antlr] /home/jogamp/JogAmpSlavex32/workspace/gluegen/label/linux-x86_32-nvidia/build/gensrc/java/com/jogamp/gluegen/cgram/StdCParser.g:1371:17: warning:lexical nondeterminism between alts 2 and 3 of block upon
    [antlr] /home/jogamp/JogAmpSlavex32/workspace/gluegen/label/linux-x86_32-nvidia/build/gensrc/java/com/jogamp/gluegen/cgram/StdCParser.g:1371:17:     k==1:'U','u'
    [antlr] /home/jogamp/JogAmpSlavex32/workspace/gluegen/label/linux-x86_32-nvidia/build/gensrc/java/com/jogamp/gluegen/cgram/StdCParser.g:1371:17:     k==2:<end-of-token>,'\u0000'..'\u00ff'
    [antlr] /home/jogamp/JogAmpSlavex32/workspace/gluegen/label/linux-x86_32-nvidia/build/gensrc/java/com/jogamp/gluegen/cgram/StdCParser.g:1371:17:     k==3:<end-of-token>,'\u0000'..'\u00ff'
    [antlr] /home/jogamp/JogAmpSlavex32/workspace/gluegen/label/linux-x86_32-nvidia/build/gensrc/java/com/jogamp/gluegen/cgram/StdCParser.g:1375: warning:lexical nondeterminism upon
    [antlr] /home/jogamp/JogAmpSlavex32/workspace/gluegen/label/linux-x86_32-nvidia/build/gensrc/java/com/jogamp/gluegen/cgram/StdCParser.g:1375:     k==1:'0'..'9'
    [antlr] /home/jogamp/JogAmpSlavex32/workspace/gluegen/label/linux-x86_32-nvidia/build/gensrc/java/com/jogamp/gluegen/cgram/StdCParser.g:1375:     k==2:<end-of-token>,'\u0000'..'\u00ff'
    [antlr] /home/jogamp/JogAmpSlavex32/workspace/gluegen/label/linux-x86_32-nvidia/build/gensrc/java/com/jogamp/gluegen/cgram/StdCParser.g:1375:     k==3:<end-of-token>,'\u0000'..'\u00ff'
    [antlr] /home/jogamp/JogAmpSlavex32/workspace/gluegen/label/linux-x86_32-nvidia/build/gensrc/java/com/jogamp/gluegen/cgram/StdCParser.g:1375:     between alt 1 and exit branch of block
    [antlr] /home/jogamp/JogAmpSlavex32/workspace/gluegen/label/linux-x86_32-nvidia/build/gensrc/java/com/jogamp/gluegen/cgram/StdCParser.g:1376:17: warning:lexical nondeterminism between alts 1 and 3 of block upon
    [antlr] /home/jogamp/JogAmpSlavex32/workspace/gluegen/label/linux-x86_32-nvidia/build/gensrc/java/com/jogamp/gluegen/cgram/StdCParser.g:1376:17:     k==1:'L','l'
    [antlr] /home/jogamp/JogAmpSlavex32/workspace/gluegen/label/linux-x86_32-nvidia/build/gensrc/java/com/jogamp/gluegen/cgram/StdCParser.g:1376:17:     k==2:<end-of-token>,'\u0000'..'\u00ff'
    [antlr] /home/jogamp/JogAmpSlavex32/workspace/gluegen/label/linux-x86_32-nvidia/build/gensrc/java/com/jogamp/gluegen/cgram/StdCParser.g:1376:17:     k==3:<end-of-token>,'\u0000'..'\u00ff'
    [antlr] /home/jogamp/JogAmpSlavex32/workspace/gluegen/label/linux-x86_32-nvidia/build/gensrc/java/com/jogamp/gluegen/cgram/StdCParser.g:1376:17: warning:lexical nondeterminism between alts 2 and 3 of block upon
    [antlr] /home/jogamp/JogAmpSlavex32/workspace/gluegen/label/linux-x86_32-nvidia/build/gensrc/java/com/jogamp/gluegen/cgram/StdCParser.g:1376:17:     k==1:'U','u'
    [antlr] /home/jogamp/JogAmpSlavex32/workspace/gluegen/label/linux-x86_32-nvidia/build/gensrc/java/com/jogamp/gluegen/cgram/StdCParser.g:1376:17:     k==2:<end-of-token>,'\u0000'..'\u00ff'
    [antlr] /home/jogamp/JogAmpSlavex32/workspace/gluegen/label/linux-x86_32-nvidia/build/gensrc/java/com/jogamp/gluegen/cgram/StdCParser.g:1376:17:     k==3:<end-of-token>,'\u0000'..'\u00ff'
    [antlr] /home/jogamp/JogAmpSlavex32/workspace/gluegen/label/linux-x86_32-nvidia/build/gensrc/java/com/jogamp/gluegen/cgram/StdCParser.g:1219: warning:lexical nondeterminism between alts 1 and 2 of block upon
    [antlr] /home/jogamp/JogAmpSlavex32/workspace/gluegen/label/linux-x86_32-nvidia/build/gensrc/java/com/jogamp/gluegen/cgram/StdCParser.g:1219:     k==1:'\\'
    [antlr] /home/jogamp/JogAmpSlavex32/workspace/gluegen/label/linux-x86_32-nvidia/build/gensrc/java/com/jogamp/gluegen/cgram/StdCParser.g:1219:     k==2:'"','\'','0'..'7','?','\\','a','b','f','n','r','t','v','x'
    [antlr] /home/jogamp/JogAmpSlavex32/workspace/gluegen/label/linux-x86_32-nvidia/build/gensrc/java/com/jogamp/gluegen/cgram/StdCParser.g:1219:     k==3:'\u0000'..'\u00ff'
    [antlr] /home/jogamp/JogAmpSlavex32/workspace/gluegen/label/linux-x86_32-nvidia/build/gensrc/java/com/jogamp/gluegen/cgram/StdCParser.g:1308: warning:lexical nondeterminism upon
    [antlr] /home/jogamp/JogAmpSlavex32/workspace/gluegen/label/linux-x86_32-nvidia/build/gensrc/java/com/jogamp/gluegen/cgram/StdCParser.g:1308:     k==1:'0'..'9'
    [antlr] /home/jogamp/JogAmpSlavex32/workspace/gluegen/label/linux-x86_32-nvidia/build/gensrc/java/com/jogamp/gluegen/cgram/StdCParser.g:1308:     k==2:<end-of-token>,'\u0000'..'\u00ff'
    [antlr] /home/jogamp/JogAmpSlavex32/workspace/gluegen/label/linux-x86_32-nvidia/build/gensrc/java/com/jogamp/gluegen/cgram/StdCParser.g:1308:     k==3:<end-of-token>,'\u0000'..'\u00ff'
    [antlr] /home/jogamp/JogAmpSlavex32/workspace/gluegen/label/linux-x86_32-nvidia/build/gensrc/java/com/jogamp/gluegen/cgram/StdCParser.g:1308:     between alt 1 and exit branch of block

generate.c.grammar.glib:
    [antlr] ANTLR Parser Generator   Version 2.7.7 (2006-11-01)   1989-2005
    [antlr] /home/jogamp/JogAmpSlavex32/workspace/gluegen/label/linux-x86_32-nvidia/build/gensrc/java/com/jogamp/gluegen/cgram/expandedGnuCParser.g: warning:lexical nondeterminism between rules Number and MINUS upon
    [antlr] /home/jogamp/JogAmpSlavex32/workspace/gluegen/label/linux-x86_32-nvidia/build/gensrc/java/com/jogamp/gluegen/cgram/expandedGnuCParser.g:     k==1:'-'
    [antlr] /home/jogamp/JogAmpSlavex32/workspace/gluegen/label/linux-x86_32-nvidia/build/gensrc/java/com/jogamp/gluegen/cgram/expandedGnuCParser.g:     k==2:<end-of-token>
    [antlr] /home/jogamp/JogAmpSlavex32/workspace/gluegen/label/linux-x86_32-nvidia/build/gensrc/java/com/jogamp/gluegen/cgram/expandedGnuCParser.g:     k==3:<end-of-token>
    [antlr] /home/jogamp/JogAmpSlavex32/workspace/gluegen/label/linux-x86_32-nvidia/build/gensrc/java/com/jogamp/gluegen/cgram/expandedGnuCParser.g: warning:lexical nondeterminism between rules Number and DefineExpr upon
    [antlr] /home/jogamp/JogAmpSlavex32/workspace/gluegen/label/linux-x86_32-nvidia/build/gensrc/java/com/jogamp/gluegen/cgram/expandedGnuCParser.g:     k==1:'-','.','0'..'9'
    [antlr] /home/jogamp/JogAmpSlavex32/workspace/gluegen/label/linux-x86_32-nvidia/build/gensrc/java/com/jogamp/gluegen/cgram/expandedGnuCParser.g:     k==2:<end-of-token>,'.','0'..'9','E','F','I','J','L','U','X','e','f','i','j','l','u','x'
    [antlr] /home/jogamp/JogAmpSlavex32/workspace/gluegen/label/linux-x86_32-nvidia/build/gensrc/java/com/jogamp/gluegen/cgram/expandedGnuCParser.g:     k==3:<end-of-token>,'+','-','.','0'..'9','A'..'F','I','J','L','U','a'..'f','i','j','l','u'
    [antlr] /home/jogamp/JogAmpSlavex32/workspace/gluegen/label/linux-x86_32-nvidia/build/gensrc/java/com/jogamp/gluegen/cgram/expandedGnuCParser.g: warning:lexical nondeterminism between rules Number and DefineExpr2 upon
    [antlr] /home/jogamp/JogAmpSlavex32/workspace/gluegen/label/linux-x86_32-nvidia/build/gensrc/java/com/jogamp/gluegen/cgram/expandedGnuCParser.g:     k==1:'-','.','0'..'9'
    [antlr] /home/jogamp/JogAmpSlavex32/workspace/gluegen/label/linux-x86_32-nvidia/build/gensrc/java/com/jogamp/gluegen/cgram/expandedGnuCParser.g:     k==2:<end-of-token>,'.','0'..'9','E','F','I','J','L','U','X','e','f','i','j','l','u','x'
    [antlr] /home/jogamp/JogAmpSlavex32/workspace/gluegen/label/linux-x86_32-nvidia/build/gensrc/java/com/jogamp/gluegen/cgram/expandedGnuCParser.g:     k==3:<end-of-token>,'+','-','.','0'..'9','A'..'F','I','J','L','U','a'..'f','i','j','l','u'
    [antlr] /home/jogamp/JogAmpSlavex32/workspace/gluegen/label/linux-x86_32-nvidia/build/gensrc/java/com/jogamp/gluegen/cgram/expandedGnuCParser.g: warning:lexical nondeterminism between rules PTR and DefineExpr upon
    [antlr] /home/jogamp/JogAmpSlavex32/workspace/gluegen/label/linux-x86_32-nvidia/build/gensrc/java/com/jogamp/gluegen/cgram/expandedGnuCParser.g:     k==1:'-'
    [antlr] /home/jogamp/JogAmpSlavex32/workspace/gluegen/label/linux-x86_32-nvidia/build/gensrc/java/com/jogamp/gluegen/cgram/expandedGnuCParser.g:     k==2:'>'
    [antlr] /home/jogamp/JogAmpSlavex32/workspace/gluegen/label/linux-x86_32-nvidia/build/gensrc/java/com/jogamp/gluegen/cgram/expandedGnuCParser.g:     k==3:<end-of-token>
    [antlr] /home/jogamp/JogAmpSlavex32/workspace/gluegen/label/linux-x86_32-nvidia/build/gensrc/java/com/jogamp/gluegen/cgram/expandedGnuCParser.g: warning:lexical nondeterminism between rules PTR and DefineExpr2 upon
    [antlr] /home/jogamp/JogAmpSlavex32/workspace/gluegen/label/linux-x86_32-nvidia/build/gensrc/java/com/jogamp/gluegen/cgram/expandedGnuCParser.g:     k==1:'-'
    [antlr] /home/jogamp/JogAmpSlavex32/workspace/gluegen/label/linux-x86_32-nvidia/build/gensrc/java/com/jogamp/gluegen/cgram/expandedGnuCParser.g:     k==2:'>'
    [antlr] /home/jogamp/JogAmpSlavex32/workspace/gluegen/label/linux-x86_32-nvidia/build/gensrc/java/com/jogamp/gluegen/cgram/expandedGnuCParser.g:     k==3:<end-of-token>
    [antlr] /home/jogamp/JogAmpSlavex32/workspace/gluegen/label/linux-x86_32-nvidia/build/gensrc/java/com/jogamp/gluegen/cgram/expandedGnuCParser.g: warning:lexical nondeterminism between rules LPAREN and DefineExpr upon
    [antlr] /home/jogamp/JogAmpSlavex32/workspace/gluegen/label/linux-x86_32-nvidia/build/gensrc/java/com/jogamp/gluegen/cgram/expandedGnuCParser.g:     k==1:'('
    [antlr] /home/jogamp/JogAmpSlavex32/workspace/gluegen/label/linux-x86_32-nvidia/build/gensrc/java/com/jogamp/gluegen/cgram/expandedGnuCParser.g:     k==2:<end-of-token>
    [antlr] /home/jogamp/JogAmpSlavex32/workspace/gluegen/label/linux-x86_32-nvidia/build/gensrc/java/com/jogamp/gluegen/cgram/expandedGnuCParser.g:     k==3:<end-of-token>
    [antlr] /home/jogamp/JogAmpSlavex32/workspace/gluegen/label/linux-x86_32-nvidia/build/gensrc/java/com/jogamp/gluegen/cgram/expandedGnuCParser.g: warning:lexical nondeterminism between rules MINUS and DefineExpr upon
    [antlr] /home/jogamp/JogAmpSlavex32/workspace/gluegen/label/linux-x86_32-nvidia/build/gensrc/java/com/jogamp/gluegen/cgram/expandedGnuCParser.g:     k==1:'-'
    [antlr] /home/jogamp/JogAmpSlavex32/workspace/gluegen/label/linux-x86_32-nvidia/build/gensrc/java/com/jogamp/gluegen/cgram/expandedGnuCParser.g:     k==2:<end-of-token>
    [antlr] /home/jogamp/JogAmpSlavex32/workspace/gluegen/label/linux-x86_32-nvidia/build/gensrc/java/com/jogamp/gluegen/cgram/expandedGnuCParser.g:     k==3:<end-of-token>
    [antlr] /home/jogamp/JogAmpSlavex32/workspace/gluegen/label/linux-x86_32-nvidia/build/gensrc/java/com/jogamp/gluegen/cgram/expandedGnuCParser.g: warning:lexical nondeterminism between rules MINUS and DefineExpr2 upon
    [antlr] /home/jogamp/JogAmpSlavex32/workspace/gluegen/label/linux-x86_32-nvidia/build/gensrc/java/com/jogamp/gluegen/cgram/expandedGnuCParser.g:     k==1:'-'
    [antlr] /home/jogamp/JogAmpSlavex32/workspace/gluegen/label/linux-x86_32-nvidia/build/gensrc/java/com/jogamp/gluegen/cgram/expandedGnuCParser.g:     k==2:<end-of-token>
    [antlr] /home/jogamp/JogAmpSlavex32/workspace/gluegen/label/linux-x86_32-nvidia/build/gensrc/java/com/jogamp/gluegen/cgram/expandedGnuCParser.g:     k==3:<end-of-token>
    [antlr] /home/jogamp/JogAmpSlavex32/workspace/gluegen/label/linux-x86_32-nvidia/build/gensrc/java/com/jogamp/gluegen/cgram/expandedGnuCParser.g: warning:lexical nondeterminism between rules DEC and DefineExpr upon
    [antlr] /home/jogamp/JogAmpSlavex32/workspace/gluegen/label/linux-x86_32-nvidia/build/gensrc/java/com/jogamp/gluegen/cgram/expandedGnuCParser.g:     k==1:'-'
    [antlr] /home/jogamp/JogAmpSlavex32/workspace/gluegen/label/linux-x86_32-nvidia/build/gensrc/java/com/jogamp/gluegen/cgram/expandedGnuCParser.g:     k==2:'-'
    [antlr] /home/jogamp/JogAmpSlavex32/workspace/gluegen/label/linux-x86_32-nvidia/build/gensrc/java/com/jogamp/gluegen/cgram/expandedGnuCParser.g:     k==3:<end-of-token>
    [antlr] /home/jogamp/JogAmpSlavex32/workspace/gluegen/label/linux-x86_32-nvidia/build/gensrc/java/com/jogamp/gluegen/cgram/expandedGnuCParser.g: warning:lexical nondeterminism between rules DEC and DefineExpr2 upon
    [antlr] /home/jogamp/JogAmpSlavex32/workspace/gluegen/label/linux-x86_32-nvidia/build/gensrc/java/com/jogamp/gluegen/cgram/expandedGnuCParser.g:     k==1:'-'
    [antlr] /home/jogamp/JogAmpSlavex32/workspace/gluegen/label/linux-x86_32-nvidia/build/gensrc/java/com/jogamp/gluegen/cgram/expandedGnuCParser.g:     k==2:'-'
    [antlr] /home/jogamp/JogAmpSlavex32/workspace/gluegen/label/linux-x86_32-nvidia/build/gensrc/java/com/jogamp/gluegen/cgram/expandedGnuCParser.g:     k==3:<end-of-token>
    [antlr] /home/jogamp/JogAmpSlavex32/workspace/gluegen/label/linux-x86_32-nvidia/build/gensrc/java/com/jogamp/gluegen/cgram/expandedGnuCParser.g: warning:lexical nondeterminism between rules DefineExpr and DefineExpr2 upon
    [antlr] /home/jogamp/JogAmpSlavex32/workspace/gluegen/label/linux-x86_32-nvidia/build/gensrc/java/com/jogamp/gluegen/cgram/expandedGnuCParser.g:     k==1:'-','.','0'..'9'
    [antlr] /home/jogamp/JogAmpSlavex32/workspace/gluegen/label/linux-x86_32-nvidia/build/gensrc/java/com/jogamp/gluegen/cgram/expandedGnuCParser.g:     k==2:<end-of-token>,'\t','\u000c',' ','%','*','+','-'..'9','<','>','E','F','I','J','L','U','X','e','f','i','j','l','u','x'
    [antlr] /home/jogamp/JogAmpSlavex32/workspace/gluegen/label/linux-x86_32-nvidia/build/gensrc/java/com/jogamp/gluegen/cgram/expandedGnuCParser.g:     k==3:<end-of-token>,'\t','\u000c',' ','%','(','*','+','-'..'9','<','>','A'..'F','I','J','L','U','a'..'f','i','j','l','u'
    [antlr] /home/jogamp/JogAmpSlavex32/workspace/gluegen/label/linux-x86_32-nvidia/build/gensrc/java/com/jogamp/gluegen/cgram/expandedGnuCParser.g:999: warning:lexical nondeterminism between alts 4 and 6 of block upon
    [antlr] /home/jogamp/JogAmpSlavex32/workspace/gluegen/label/linux-x86_32-nvidia/build/gensrc/java/com/jogamp/gluegen/cgram/expandedGnuCParser.g:999:     k==1:'0'
    [antlr] /home/jogamp/JogAmpSlavex32/workspace/gluegen/label/linux-x86_32-nvidia/build/gensrc/java/com/jogamp/gluegen/cgram/expandedGnuCParser.g:999:     k==2:'X','x'
    [antlr] /home/jogamp/JogAmpSlavex32/workspace/gluegen/label/linux-x86_32-nvidia/build/gensrc/java/com/jogamp/gluegen/cgram/expandedGnuCParser.g:999:     k==3:'0'..'9','A'..'F','a'..'f'
    [antlr] /home/jogamp/JogAmpSlavex32/workspace/gluegen/label/linux-x86_32-nvidia/build/gensrc/java/com/jogamp/gluegen/cgram/expandedGnuCParser.g:1023: warning:lexical nondeterminism upon
    [antlr] /home/jogamp/JogAmpSlavex32/workspace/gluegen/label/linux-x86_32-nvidia/build/gensrc/java/com/jogamp/gluegen/cgram/expandedGnuCParser.g:1023:     k==1:'a'..'f'
    [antlr] /home/jogamp/JogAmpSlavex32/workspace/gluegen/label/linux-x86_32-nvidia/build/gensrc/java/com/jogamp/gluegen/cgram/expandedGnuCParser.g:1023:     k==2:<end-of-token>,'\u0000'..'\u00ff'
    [antlr] /home/jogamp/JogAmpSlavex32/workspace/gluegen/label/linux-x86_32-nvidia/build/gensrc/java/com/jogamp/gluegen/cgram/expandedGnuCParser.g:1023:     k==3:<end-of-token>,'\u0000'..'\u00ff'
    [antlr] /home/jogamp/JogAmpSlavex32/workspace/gluegen/label/linux-x86_32-nvidia/build/gensrc/java/com/jogamp/gluegen/cgram/expandedGnuCParser.g:1023:     between alt 1 and exit branch of block
    [antlr] /home/jogamp/JogAmpSlavex32/workspace/gluegen/label/linux-x86_32-nvidia/build/gensrc/java/com/jogamp/gluegen/cgram/expandedGnuCParser.g:1023: warning:lexical nondeterminism upon
    [antlr] /home/jogamp/JogAmpSlavex32/workspace/gluegen/label/linux-x86_32-nvidia/build/gensrc/java/com/jogamp/gluegen/cgram/expandedGnuCParser.g:1023:     k==1:'A'..'F'
    [antlr] /home/jogamp/JogAmpSlavex32/workspace/gluegen/label/linux-x86_32-nvidia/build/gensrc/java/com/jogamp/gluegen/cgram/expandedGnuCParser.g:1023:     k==2:<end-of-token>,'\u0000'..'\u00ff'
    [antlr] /home/jogamp/JogAmpSlavex32/workspace/gluegen/label/linux-x86_32-nvidia/build/gensrc/java/com/jogamp/gluegen/cgram/expandedGnuCParser.g:1023:     k==3:<end-of-token>,'\u0000'..'\u00ff'
    [antlr] /home/jogamp/JogAmpSlavex32/workspace/gluegen/label/linux-x86_32-nvidia/build/gensrc/java/com/jogamp/gluegen/cgram/expandedGnuCParser.g:1023:     between alt 2 and exit branch of block
    [antlr] /home/jogamp/JogAmpSlavex32/workspace/gluegen/label/linux-x86_32-nvidia/build/gensrc/java/com/jogamp/gluegen/cgram/expandedGnuCParser.g:1023: warning:lexical nondeterminism upon
    [antlr] /home/jogamp/JogAmpSlavex32/workspace/gluegen/label/linux-x86_32-nvidia/build/gensrc/java/com/jogamp/gluegen/cgram/expandedGnuCParser.g:1023:     k==1:'0'..'9'
    [antlr] /home/jogamp/JogAmpSlavex32/workspace/gluegen/label/linux-x86_32-nvidia/build/gensrc/java/com/jogamp/gluegen/cgram/expandedGnuCParser.g:1023:     k==2:<end-of-token>,'\u0000'..'\u00ff'
    [antlr] /home/jogamp/JogAmpSlavex32/workspace/gluegen/label/linux-x86_32-nvidia/build/gensrc/java/com/jogamp/gluegen/cgram/expandedGnuCParser.g:1023:     k==3:<end-of-token>,'\u0000'..'\u00ff'
    [antlr] /home/jogamp/JogAmpSlavex32/workspace/gluegen/label/linux-x86_32-nvidia/build/gensrc/java/com/jogamp/gluegen/cgram/expandedGnuCParser.g:1023:     between alt 3 and exit branch of block
    [antlr] /home/jogamp/JogAmpSlavex32/workspace/gluegen/label/linux-x86_32-nvidia/build/gensrc/java/com/jogamp/gluegen/cgram/expandedGnuCParser.g:1024: warning:lexical nondeterminism upon
    [antlr] /home/jogamp/JogAmpSlavex32/workspace/gluegen/label/linux-x86_32-nvidia/build/gensrc/java/com/jogamp/gluegen/cgram/expandedGnuCParser.g:1024:     k==1:'I','J','L','U','i','j','l','u'
    [antlr] /home/jogamp/JogAmpSlavex32/workspace/gluegen/label/linux-x86_32-nvidia/build/gensrc/java/com/jogamp/gluegen/cgram/expandedGnuCParser.g:1024:     k==2:<end-of-token>,'\u0000'..'\u00ff'
    [antlr] /home/jogamp/JogAmpSlavex32/workspace/gluegen/label/linux-x86_32-nvidia/build/gensrc/java/com/jogamp/gluegen/cgram/expandedGnuCParser.g:1024:     k==3:<end-of-token>,'\u0000'..'\u00ff'
    [antlr] /home/jogamp/JogAmpSlavex32/workspace/gluegen/label/linux-x86_32-nvidia/build/gensrc/java/com/jogamp/gluegen/cgram/expandedGnuCParser.g:1024:     between alt 1 and exit branch of block
    [antlr] /home/jogamp/JogAmpSlavex32/workspace/gluegen/label/linux-x86_32-nvidia/build/gensrc/java/com/jogamp/gluegen/cgram/expandedGnuCParser.g:1000: warning:lexical nondeterminism upon
    [antlr] /home/jogamp/JogAmpSlavex32/workspace/gluegen/label/linux-x86_32-nvidia/build/gensrc/java/com/jogamp/gluegen/cgram/expandedGnuCParser.g:1000:     k==1:'0'..'9'
    [antlr] /home/jogamp/JogAmpSlavex32/workspace/gluegen/label/linux-x86_32-nvidia/build/gensrc/java/com/jogamp/gluegen/cgram/expandedGnuCParser.g:1000:     k==2:<end-of-token>,'\u0000'..'\u00ff'
    [antlr] /home/jogamp/JogAmpSlavex32/workspace/gluegen/label/linux-x86_32-nvidia/build/gensrc/java/com/jogamp/gluegen/cgram/expandedGnuCParser.g:1000:     k==3:<end-of-token>,'\u0000'..'\u00ff'
    [antlr] /home/jogamp/JogAmpSlavex32/workspace/gluegen/label/linux-x86_32-nvidia/build/gensrc/java/com/jogamp/gluegen/cgram/expandedGnuCParser.g:1000:     between alt 1 and exit branch of block
    [antlr] /home/jogamp/JogAmpSlavex32/workspace/gluegen/label/linux-x86_32-nvidia/build/gensrc/java/com/jogamp/gluegen/cgram/expandedGnuCParser.g:1000:34: warning:lexical nondeterminism between alts 1 and 2 of block upon
    [antlr] /home/jogamp/JogAmpSlavex32/workspace/gluegen/label/linux-x86_32-nvidia/build/gensrc/java/com/jogamp/gluegen/cgram/expandedGnuCParser.g:1000:34:     k==1:'E','e'
    [antlr] /home/jogamp/JogAmpSlavex32/workspace/gluegen/label/linux-x86_32-nvidia/build/gensrc/java/com/jogamp/gluegen/cgram/expandedGnuCParser.g:1000:34:     k==2:'+','-','0'..'9'
    [antlr] /home/jogamp/JogAmpSlavex32/workspace/gluegen/label/linux-x86_32-nvidia/build/gensrc/java/com/jogamp/gluegen/cgram/expandedGnuCParser.g:1000:34:     k==3:<end-of-token>,'\u0000'..'\u00ff'
    [antlr] /home/jogamp/JogAmpSlavex32/workspace/gluegen/label/linux-x86_32-nvidia/build/gensrc/java/com/jogamp/gluegen/cgram/expandedGnuCParser.g:1003: warning:lexical nondeterminism upon
    [antlr] /home/jogamp/JogAmpSlavex32/workspace/gluegen/label/linux-x86_32-nvidia/build/gensrc/java/com/jogamp/gluegen/cgram/expandedGnuCParser.g:1003:     k==1:'F','I','J','L','U','f','i','j','l','u'
    [antlr] /home/jogamp/JogAmpSlavex32/workspace/gluegen/label/linux-x86_32-nvidia/build/gensrc/java/com/jogamp/gluegen/cgram/expandedGnuCParser.g:1003:     k==2:<end-of-token>,'\u0000'..'\u00ff'
    [antlr] /home/jogamp/JogAmpSlavex32/workspace/gluegen/label/linux-x86_32-nvidia/build/gensrc/java/com/jogamp/gluegen/cgram/expandedGnuCParser.g:1003:     k==3:<end-of-token>,'\u0000'..'\u00ff'
    [antlr] /home/jogamp/JogAmpSlavex32/workspace/gluegen/label/linux-x86_32-nvidia/build/gensrc/java/com/jogamp/gluegen/cgram/expandedGnuCParser.g:1003:     between alt 1 and exit branch of block
    [antlr] /home/jogamp/JogAmpSlavex32/workspace/gluegen/label/linux-x86_32-nvidia/build/gensrc/java/com/jogamp/gluegen/cgram/expandedGnuCParser.g:1009:17: warning:lexical nondeterminism between alts 1 and 2 of block upon
    [antlr] /home/jogamp/JogAmpSlavex32/workspace/gluegen/label/linux-x86_32-nvidia/build/gensrc/java/com/jogamp/gluegen/cgram/expandedGnuCParser.g:1009:17:     k==1:'0'..'9'
    [antlr] /home/jogamp/JogAmpSlavex32/workspace/gluegen/label/linux-x86_32-nvidia/build/gensrc/java/com/jogamp/gluegen/cgram/expandedGnuCParser.g:1009:17:     k==2:<end-of-token>,'\u0000'..'\u00ff'
    [antlr] /home/jogamp/JogAmpSlavex32/workspace/gluegen/label/linux-x86_32-nvidia/build/gensrc/java/com/jogamp/gluegen/cgram/expandedGnuCParser.g:1009:17:     k==3:<end-of-token>,'\u0000'..'\u00ff'
    [antlr] /home/jogamp/JogAmpSlavex32/workspace/gluegen/label/linux-x86_32-nvidia/build/gensrc/java/com/jogamp/gluegen/cgram/expandedGnuCParser.g:1009: warning:lexical nondeterminism upon
    [antlr] /home/jogamp/JogAmpSlavex32/workspace/gluegen/label/linux-x86_32-nvidia/build/gensrc/java/com/jogamp/gluegen/cgram/expandedGnuCParser.g:1009:     k==1:'0'..'9'
    [antlr] /home/jogamp/JogAmpSlavex32/workspace/gluegen/label/linux-x86_32-nvidia/build/gensrc/java/com/jogamp/gluegen/cgram/expandedGnuCParser.g:1009:     k==2:<end-of-token>,'\u0000'..'\u00ff'
    [antlr] /home/jogamp/JogAmpSlavex32/workspace/gluegen/label/linux-x86_32-nvidia/build/gensrc/java/com/jogamp/gluegen/cgram/expandedGnuCParser.g:1009:     k==3:<end-of-token>,'\u0000'..'\u00ff'
    [antlr] /home/jogamp/JogAmpSlavex32/workspace/gluegen/label/linux-x86_32-nvidia/build/gensrc/java/com/jogamp/gluegen/cgram/expandedGnuCParser.g:1009:     between alt 1 and exit branch of block
    [antlr] /home/jogamp/JogAmpSlavex32/workspace/gluegen/label/linux-x86_32-nvidia/build/gensrc/java/com/jogamp/gluegen/cgram/expandedGnuCParser.g:1009:30: warning:lexical nondeterminism between alts 1 and 2 of block upon
    [antlr] /home/jogamp/JogAmpSlavex32/workspace/gluegen/label/linux-x86_32-nvidia/build/gensrc/java/com/jogamp/gluegen/cgram/expandedGnuCParser.g:1009:30:     k==1:'E','e'
    [antlr] /home/jogamp/JogAmpSlavex32/workspace/gluegen/label/linux-x86_32-nvidia/build/gensrc/java/com/jogamp/gluegen/cgram/expandedGnuCParser.g:1009:30:     k==2:'+','-','0'..'9'
    [antlr] /home/jogamp/JogAmpSlavex32/workspace/gluegen/label/linux-x86_32-nvidia/build/gensrc/java/com/jogamp/gluegen/cgram/expandedGnuCParser.g:1009:30:     k==3:<end-of-token>,'\u0000'..'\u00ff'
    [antlr] /home/jogamp/JogAmpSlavex32/workspace/gluegen/label/linux-x86_32-nvidia/build/gensrc/java/com/jogamp/gluegen/cgram/expandedGnuCParser.g:1011: warning:lexical nondeterminism upon
    [antlr] /home/jogamp/JogAmpSlavex32/workspace/gluegen/label/linux-x86_32-nvidia/build/gensrc/java/com/jogamp/gluegen/cgram/expandedGnuCParser.g:1011:     k==1:'F','I','J','L','U','f','i','j','l','u'
    [antlr] /home/jogamp/JogAmpSlavex32/workspace/gluegen/label/linux-x86_32-nvidia/build/gensrc/java/com/jogamp/gluegen/cgram/expandedGnuCParser.g:1011:     k==2:<end-of-token>,'\u0000'..'\u00ff'
    [antlr] /home/jogamp/JogAmpSlavex32/workspace/gluegen/label/linux-x86_32-nvidia/build/gensrc/java/com/jogamp/gluegen/cgram/expandedGnuCParser.g:1011:     k==3:<end-of-token>,'\u0000'..'\u00ff'
    [antlr] /home/jogamp/JogAmpSlavex32/workspace/gluegen/label/linux-x86_32-nvidia/build/gensrc/java/com/jogamp/gluegen/cgram/expandedGnuCParser.g:1011:     between alt 1 and exit branch of block
    [antlr] /home/jogamp/JogAmpSlavex32/workspace/gluegen/label/linux-x86_32-nvidia/build/gensrc/java/com/jogamp/gluegen/cgram/expandedGnuCParser.g:1015: warning:lexical nondeterminism upon
    [antlr] /home/jogamp/JogAmpSlavex32/workspace/gluegen/label/linux-x86_32-nvidia/build/gensrc/java/com/jogamp/gluegen/cgram/expandedGnuCParser.g:1015:     k==1:'0'..'7'
    [antlr] /home/jogamp/JogAmpSlavex32/workspace/gluegen/label/linux-x86_32-nvidia/build/gensrc/java/com/jogamp/gluegen/cgram/expandedGnuCParser.g:1015:     k==2:<end-of-token>,'\u0000'..'\u00ff'
    [antlr] /home/jogamp/JogAmpSlavex32/workspace/gluegen/label/linux-x86_32-nvidia/build/gensrc/java/com/jogamp/gluegen/cgram/expandedGnuCParser.g:1015:     k==3:<end-of-token>,'\u0000'..'\u00ff'
    [antlr] /home/jogamp/JogAmpSlavex32/workspace/gluegen/label/linux-x86_32-nvidia/build/gensrc/java/com/jogamp/gluegen/cgram/expandedGnuCParser.g:1015:     between alt 1 and exit branch of block
    [antlr] /home/jogamp/JogAmpSlavex32/workspace/gluegen/label/linux-x86_32-nvidia/build/gensrc/java/com/jogamp/gluegen/cgram/expandedGnuCParser.g:1016: warning:lexical nondeterminism upon
    [antlr] /home/jogamp/JogAmpSlavex32/workspace/gluegen/label/linux-x86_32-nvidia/build/gensrc/java/com/jogamp/gluegen/cgram/expandedGnuCParser.g:1016:     k==1:'F','I','J','L','U','f','i','j','l','u'
    [antlr] /home/jogamp/JogAmpSlavex32/workspace/gluegen/label/linux-x86_32-nvidia/build/gensrc/java/com/jogamp/gluegen/cgram/expandedGnuCParser.g:1016:     k==2:<end-of-token>,'\u0000'..'\u00ff'
    [antlr] /home/jogamp/JogAmpSlavex32/workspace/gluegen/label/linux-x86_32-nvidia/build/gensrc/java/com/jogamp/gluegen/cgram/expandedGnuCParser.g:1016:     k==3:<end-of-token>,'\u0000'..'\u00ff'
    [antlr] /home/jogamp/JogAmpSlavex32/workspace/gluegen/label/linux-x86_32-nvidia/build/gensrc/java/com/jogamp/gluegen/cgram/expandedGnuCParser.g:1016:     between alt 1 and exit branch of block
    [antlr] /home/jogamp/JogAmpSlavex32/workspace/gluegen/label/linux-x86_32-nvidia/build/gensrc/java/com/jogamp/gluegen/cgram/expandedGnuCParser.g:1019: warning:lexical nondeterminism upon
    [antlr] /home/jogamp/JogAmpSlavex32/workspace/gluegen/label/linux-x86_32-nvidia/build/gensrc/java/com/jogamp/gluegen/cgram/expandedGnuCParser.g:1019:     k==1:'0'..'9'
    [antlr] /home/jogamp/JogAmpSlavex32/workspace/gluegen/label/linux-x86_32-nvidia/build/gensrc/java/com/jogamp/gluegen/cgram/expandedGnuCParser.g:1019:     k==2:<end-of-token>,'\u0000'..'\u00ff'
    [antlr] /home/jogamp/JogAmpSlavex32/workspace/gluegen/label/linux-x86_32-nvidia/build/gensrc/java/com/jogamp/gluegen/cgram/expandedGnuCParser.g:1019:     k==3:<end-of-token>,'\u0000'..'\u00ff'
    [antlr] /home/jogamp/JogAmpSlavex32/workspace/gluegen/label/linux-x86_32-nvidia/build/gensrc/java/com/jogamp/gluegen/cgram/expandedGnuCParser.g:1019:     between alt 1 and exit branch of block
    [antlr] /home/jogamp/JogAmpSlavex32/workspace/gluegen/label/linux-x86_32-nvidia/build/gensrc/java/com/jogamp/gluegen/cgram/expandedGnuCParser.g:1020: warning:lexical nondeterminism upon
    [antlr] /home/jogamp/JogAmpSlavex32/workspace/gluegen/label/linux-x86_32-nvidia/build/gensrc/java/com/jogamp/gluegen/cgram/expandedGnuCParser.g:1020:     k==1:'F','I','J','L','U','f','i','j','l','u'
    [antlr] /home/jogamp/JogAmpSlavex32/workspace/gluegen/label/linux-x86_32-nvidia/build/gensrc/java/com/jogamp/gluegen/cgram/expandedGnuCParser.g:1020:     k==2:<end-of-token>,'\u0000'..'\u00ff'
    [antlr] /home/jogamp/JogAmpSlavex32/workspace/gluegen/label/linux-x86_32-nvidia/build/gensrc/java/com/jogamp/gluegen/cgram/expandedGnuCParser.g:1020:     k==3:<end-of-token>,'\u0000'..'\u00ff'
    [antlr] /home/jogamp/JogAmpSlavex32/workspace/gluegen/label/linux-x86_32-nvidia/build/gensrc/java/com/jogamp/gluegen/cgram/expandedGnuCParser.g:1020:     between alt 1 and exit branch of block
    [antlr] /home/jogamp/JogAmpSlavex32/workspace/gluegen/label/linux-x86_32-nvidia/build/gensrc/java/com/jogamp/gluegen/cgram/expandedGnuCParser.g:1336: warning:lexical nondeterminism upon
    [antlr] /home/jogamp/JogAmpSlavex32/workspace/gluegen/label/linux-x86_32-nvidia/build/gensrc/java/com/jogamp/gluegen/cgram/expandedGnuCParser.g:1336:     k==1:'0'..'9'
    [antlr] /home/jogamp/JogAmpSlavex32/workspace/gluegen/label/linux-x86_32-nvidia/build/gensrc/java/com/jogamp/gluegen/cgram/expandedGnuCParser.g:1336:     k==2:<end-of-token>,'\u0000'..'\u00ff'
    [antlr] /home/jogamp/JogAmpSlavex32/workspace/gluegen/label/linux-x86_32-nvidia/build/gensrc/java/com/jogamp/gluegen/cgram/expandedGnuCParser.g:1336:     k==3:<end-of-token>,'\u0000'..'\u00ff'
    [antlr] /home/jogamp/JogAmpSlavex32/workspace/gluegen/label/linux-x86_32-nvidia/build/gensrc/java/com/jogamp/gluegen/cgram/expandedGnuCParser.g:1336:     between alt 1 and exit branch of block
    [antlr] /home/jogamp/JogAmpSlavex32/workspace/gluegen/label/linux-x86_32-nvidia/build/gensrc/java/com/jogamp/gluegen/cgram/expandedGnuCParser.g:1045: warning:lexical nondeterminism upon
    [antlr] /home/jogamp/JogAmpSlavex32/workspace/gluegen/label/linux-x86_32-nvidia/build/gensrc/java/com/jogamp/gluegen/cgram/expandedGnuCParser.g:1045:     k==1:'a'..'z'
    [antlr] /home/jogamp/JogAmpSlavex32/workspace/gluegen/label/linux-x86_32-nvidia/build/gensrc/java/com/jogamp/gluegen/cgram/expandedGnuCParser.g:1045:     k==2:<end-of-token>,'\u0000'..'\u00ff'
    [antlr] /home/jogamp/JogAmpSlavex32/workspace/gluegen/label/linux-x86_32-nvidia/build/gensrc/java/com/jogamp/gluegen/cgram/expandedGnuCParser.g:1045:     k==3:<end-of-token>,'\u0000'..'\u00ff'
    [antlr] /home/jogamp/JogAmpSlavex32/workspace/gluegen/label/linux-x86_32-nvidia/build/gensrc/java/com/jogamp/gluegen/cgram/expandedGnuCParser.g:1045:     between alt 1 and exit branch of block
    [antlr] /home/jogamp/JogAmpSlavex32/workspace/gluegen/label/linux-x86_32-nvidia/build/gensrc/java/com/jogamp/gluegen/cgram/expandedGnuCParser.g:1045: warning:lexical nondeterminism upon
    [antlr] /home/jogamp/JogAmpSlavex32/workspace/gluegen/label/linux-x86_32-nvidia/build/gensrc/java/com/jogamp/gluegen/cgram/expandedGnuCParser.g:1045:     k==1:'A'..'Z'
    [antlr] /home/jogamp/JogAmpSlavex32/workspace/gluegen/label/linux-x86_32-nvidia/build/gensrc/java/com/jogamp/gluegen/cgram/expandedGnuCParser.g:1045:     k==2:<end-of-token>,'\u0000'..'\u00ff'
    [antlr] /home/jogamp/JogAmpSlavex32/workspace/gluegen/label/linux-x86_32-nvidia/build/gensrc/java/com/jogamp/gluegen/cgram/expandedGnuCParser.g:1045:     k==3:<end-of-token>,'\u0000'..'\u00ff'
    [antlr] /home/jogamp/JogAmpSlavex32/workspace/gluegen/label/linux-x86_32-nvidia/build/gensrc/java/com/jogamp/gluegen/cgram/expandedGnuCParser.g:1045:     between alt 2 and exit branch of block
    [antlr] /home/jogamp/JogAmpSlavex32/workspace/gluegen/label/linux-x86_32-nvidia/build/gensrc/java/com/jogamp/gluegen/cgram/expandedGnuCParser.g:1045: warning:lexical nondeterminism upon
    [antlr] /home/jogamp/JogAmpSlavex32/workspace/gluegen/label/linux-x86_32-nvidia/build/gensrc/java/com/jogamp/gluegen/cgram/expandedGnuCParser.g:1045:     k==1:'_'
    [antlr] /home/jogamp/JogAmpSlavex32/workspace/gluegen/label/linux-x86_32-nvidia/build/gensrc/java/com/jogamp/gluegen/cgram/expandedGnuCParser.g:1045:     k==2:<end-of-token>,'\u0000'..'\u00ff'
    [antlr] /home/jogamp/JogAmpSlavex32/workspace/gluegen/label/linux-x86_32-nvidia/build/gensrc/java/com/jogamp/gluegen/cgram/expandedGnuCParser.g:1045:     k==3:<end-of-token>,'\u0000'..'\u00ff'
    [antlr] /home/jogamp/JogAmpSlavex32/workspace/gluegen/label/linux-x86_32-nvidia/build/gensrc/java/com/jogamp/gluegen/cgram/expandedGnuCParser.g:1045:     between alt 3 and exit branch of block
    [antlr] /home/jogamp/JogAmpSlavex32/workspace/gluegen/label/linux-x86_32-nvidia/build/gensrc/java/com/jogamp/gluegen/cgram/expandedGnuCParser.g:1045: warning:lexical nondeterminism upon
    [antlr] /home/jogamp/JogAmpSlavex32/workspace/gluegen/label/linux-x86_32-nvidia/build/gensrc/java/com/jogamp/gluegen/cgram/expandedGnuCParser.g:1045:     k==1:'$'
    [antlr] /home/jogamp/JogAmpSlavex32/workspace/gluegen/label/linux-x86_32-nvidia/build/gensrc/java/com/jogamp/gluegen/cgram/expandedGnuCParser.g:1045:     k==2:<end-of-token>,'\u0000'..'\u00ff'
    [antlr] /home/jogamp/JogAmpSlavex32/workspace/gluegen/label/linux-x86_32-nvidia/build/gensrc/java/com/jogamp/gluegen/cgram/expandedGnuCParser.g:1045:     k==3:<end-of-token>,'\u0000'..'\u00ff'
    [antlr] /home/jogamp/JogAmpSlavex32/workspace/gluegen/label/linux-x86_32-nvidia/build/gensrc/java/com/jogamp/gluegen/cgram/expandedGnuCParser.g:1045:     between alt 4 and exit branch of block
    [antlr] /home/jogamp/JogAmpSlavex32/workspace/gluegen/label/linux-x86_32-nvidia/build/gensrc/java/com/jogamp/gluegen/cgram/expandedGnuCParser.g:1045: warning:lexical nondeterminism upon
    [antlr] /home/jogamp/JogAmpSlavex32/workspace/gluegen/label/linux-x86_32-nvidia/build/gensrc/java/com/jogamp/gluegen/cgram/expandedGnuCParser.g:1045:     k==1:'0'..'9'
    [antlr] /home/jogamp/JogAmpSlavex32/workspace/gluegen/label/linux-x86_32-nvidia/build/gensrc/java/com/jogamp/gluegen/cgram/expandedGnuCParser.g:1045:     k==2:<end-of-token>,'\u0000'..'\u00ff'
    [antlr] /home/jogamp/JogAmpSlavex32/workspace/gluegen/label/linux-x86_32-nvidia/build/gensrc/java/com/jogamp/gluegen/cgram/expandedGnuCParser.g:1045:     k==3:<end-of-token>,'\u0000'..'\u00ff'
    [antlr] /home/jogamp/JogAmpSlavex32/workspace/gluegen/label/linux-x86_32-nvidia/build/gensrc/java/com/jogamp/gluegen/cgram/expandedGnuCParser.g:1045:     between alt 5 and exit branch of block
    [antlr] /home/jogamp/JogAmpSlavex32/workspace/gluegen/label/linux-x86_32-nvidia/build/gensrc/java/com/jogamp/gluegen/cgram/expandedGnuCParser.g:1215: warning:lexical nondeterminism between alts 2 and 3 of block upon
    [antlr] /home/jogamp/JogAmpSlavex32/workspace/gluegen/label/linux-x86_32-nvidia/build/gensrc/java/com/jogamp/gluegen/cgram/expandedGnuCParser.g:1215:     k==1:'\r'
    [antlr] /home/jogamp/JogAmpSlavex32/workspace/gluegen/label/linux-x86_32-nvidia/build/gensrc/java/com/jogamp/gluegen/cgram/expandedGnuCParser.g:1215:     k==2:'\n'
    [antlr] /home/jogamp/JogAmpSlavex32/workspace/gluegen/label/linux-x86_32-nvidia/build/gensrc/java/com/jogamp/gluegen/cgram/expandedGnuCParser.g:1215:     k==3:'\u0000'..'\u00ff'
    [antlr] /home/jogamp/JogAmpSlavex32/workspace/gluegen/label/linux-x86_32-nvidia/build/gensrc/java/com/jogamp/gluegen/cgram/expandedGnuCParser.g:1241:9: warning:lexical nondeterminism between alts 2 and 3 of block upon
    [antlr] /home/jogamp/JogAmpSlavex32/workspace/gluegen/label/linux-x86_32-nvidia/build/gensrc/java/com/jogamp/gluegen/cgram/expandedGnuCParser.g:1241:9:     k==1:'\t','\u000c',' ','d'
    [antlr] /home/jogamp/JogAmpSlavex32/workspace/gluegen/label/linux-x86_32-nvidia/build/gensrc/java/com/jogamp/gluegen/cgram/expandedGnuCParser.g:1241:9:     k==2:'\t','\u000c',' ','d','e'
    [antlr] /home/jogamp/JogAmpSlavex32/workspace/gluegen/label/linux-x86_32-nvidia/build/gensrc/java/com/jogamp/gluegen/cgram/expandedGnuCParser.g:1241:9:     k==3:'\t','\u000c',' ','d'..'f'
    [antlr] /home/jogamp/JogAmpSlavex32/workspace/gluegen/label/linux-x86_32-nvidia/build/gensrc/java/com/jogamp/gluegen/cgram/expandedGnuCParser.g:1242: warning:lexical nondeterminism upon
    [antlr] /home/jogamp/JogAmpSlavex32/workspace/gluegen/label/linux-x86_32-nvidia/build/gensrc/java/com/jogamp/gluegen/cgram/expandedGnuCParser.g:1242:     k==1:'\t','\u000c',' '
    [antlr] /home/jogamp/JogAmpSlavex32/workspace/gluegen/label/linux-x86_32-nvidia/build/gensrc/java/com/jogamp/gluegen/cgram/expandedGnuCParser.g:1242:     k==2:'\u0000'..'\u00ff'
    [antlr] /home/jogamp/JogAmpSlavex32/workspace/gluegen/label/linux-x86_32-nvidia/build/gensrc/java/com/jogamp/gluegen/cgram/expandedGnuCParser.g:1242:     k==3:<end-of-token>,'\u0000'..'\u00ff'
    [antlr] /home/jogamp/JogAmpSlavex32/workspace/gluegen/label/linux-x86_32-nvidia/build/gensrc/java/com/jogamp/gluegen/cgram/expandedGnuCParser.g:1242:     between alt 1 and exit branch of block
    [antlr] /home/jogamp/JogAmpSlavex32/workspace/gluegen/label/linux-x86_32-nvidia/build/gensrc/java/com/jogamp/gluegen/cgram/expandedGnuCParser.g:1242:54: warning:lexical nondeterminism between alts 1 and 2 of block upon
    [antlr] /home/jogamp/JogAmpSlavex32/workspace/gluegen/label/linux-x86_32-nvidia/build/gensrc/java/com/jogamp/gluegen/cgram/expandedGnuCParser.g:1242:54:     k==1:'(','-','.','0'..'9'
    [antlr] /home/jogamp/JogAmpSlavex32/workspace/gluegen/label/linux-x86_32-nvidia/build/gensrc/java/com/jogamp/gluegen/cgram/expandedGnuCParser.g:1242:54:     k==2:'\u0000'..'\u00ff'
    [antlr] /home/jogamp/JogAmpSlavex32/workspace/gluegen/label/linux-x86_32-nvidia/build/gensrc/java/com/jogamp/gluegen/cgram/expandedGnuCParser.g:1242:54:     k==3:<end-of-token>,'\u0000'..'\u00ff'
    [antlr] /home/jogamp/JogAmpSlavex32/workspace/gluegen/label/linux-x86_32-nvidia/build/gensrc/java/com/jogamp/gluegen/cgram/expandedGnuCParser.g:1284: warning:lexical nondeterminism upon
    [antlr] /home/jogamp/JogAmpSlavex32/workspace/gluegen/label/linux-x86_32-nvidia/build/gensrc/java/com/jogamp/gluegen/cgram/expandedGnuCParser.g:1284:     k==1:'\t','\u000c',' '
    [antlr] /home/jogamp/JogAmpSlavex32/workspace/gluegen/label/linux-x86_32-nvidia/build/gensrc/java/com/jogamp/gluegen/cgram/expandedGnuCParser.g:1284:     k==2:'\u0000'..'\u00ff'
    [antlr] /home/jogamp/JogAmpSlavex32/workspace/gluegen/label/linux-x86_32-nvidia/build/gensrc/java/com/jogamp/gluegen/cgram/expandedGnuCParser.g:1284:     k==3:<end-of-token>,'\u0000'..'\u00ff'
    [antlr] /home/jogamp/JogAmpSlavex32/workspace/gluegen/label/linux-x86_32-nvidia/build/gensrc/java/com/jogamp/gluegen/cgram/expandedGnuCParser.g:1284:     between alt 1 and exit branch of block
    [antlr] /home/jogamp/JogAmpSlavex32/workspace/gluegen/label/linux-x86_32-nvidia/build/gensrc/java/com/jogamp/gluegen/cgram/expandedGnuCParser.g:1285:9: warning:lexical nondeterminism between alts 1 and 3 of block upon
    [antlr] /home/jogamp/JogAmpSlavex32/workspace/gluegen/label/linux-x86_32-nvidia/build/gensrc/java/com/jogamp/gluegen/cgram/expandedGnuCParser.g:1285:9:     k==1:'"'
    [antlr] /home/jogamp/JogAmpSlavex32/workspace/gluegen/label/linux-x86_32-nvidia/build/gensrc/java/com/jogamp/gluegen/cgram/expandedGnuCParser.g:1285:9:     k==2:'\u0000'..'\u00ff'
    [antlr] /home/jogamp/JogAmpSlavex32/workspace/gluegen/label/linux-x86_32-nvidia/build/gensrc/java/com/jogamp/gluegen/cgram/expandedGnuCParser.g:1285:9:     k==3:'\u0000'..'\u00ff'
    [antlr] /home/jogamp/JogAmpSlavex32/workspace/gluegen/label/linux-x86_32-nvidia/build/gensrc/java/com/jogamp/gluegen/cgram/expandedGnuCParser.g:1285:9: warning:lexical nondeterminism between alts 2 and 3 of block upon
    [antlr] /home/jogamp/JogAmpSlavex32/workspace/gluegen/label/linux-x86_32-nvidia/build/gensrc/java/com/jogamp/gluegen/cgram/expandedGnuCParser.g:1285:9:     k==1:'$','A'..'Z','_','a'..'z'
    [antlr] /home/jogamp/JogAmpSlavex32/workspace/gluegen/label/linux-x86_32-nvidia/build/gensrc/java/com/jogamp/gluegen/cgram/expandedGnuCParser.g:1285:9:     k==2:'\u0000'..'\u00ff'
    [antlr] /home/jogamp/JogAmpSlavex32/workspace/gluegen/label/linux-x86_32-nvidia/build/gensrc/java/com/jogamp/gluegen/cgram/expandedGnuCParser.g:1285:9:     k==3:<end-of-token>,'\u0000'..'\u00ff'
    [antlr] /home/jogamp/JogAmpSlavex32/workspace/gluegen/label/linux-x86_32-nvidia/build/gensrc/java/com/jogamp/gluegen/cgram/expandedGnuCParser.g:1292: warning:lexical nondeterminism upon
    [antlr] /home/jogamp/JogAmpSlavex32/workspace/gluegen/label/linux-x86_32-nvidia/build/gensrc/java/com/jogamp/gluegen/cgram/expandedGnuCParser.g:1292:     k==1:'\t','\u000c',' '
    [antlr] /home/jogamp/JogAmpSlavex32/workspace/gluegen/label/linux-x86_32-nvidia/build/gensrc/java/com/jogamp/gluegen/cgram/expandedGnuCParser.g:1292:     k==2:'\u0000'..'\u00ff'
    [antlr] /home/jogamp/JogAmpSlavex32/workspace/gluegen/label/linux-x86_32-nvidia/build/gensrc/java/com/jogamp/gluegen/cgram/expandedGnuCParser.g:1292:     k==3:<end-of-token>,'\u0000'..'\u00ff'
    [antlr] /home/jogamp/JogAmpSlavex32/workspace/gluegen/label/linux-x86_32-nvidia/build/gensrc/java/com/jogamp/gluegen/cgram/expandedGnuCParser.g:1292:     between alt 1 and exit branch of block
    [antlr] /home/jogamp/JogAmpSlavex32/workspace/gluegen/label/linux-x86_32-nvidia/build/gensrc/java/com/jogamp/gluegen/cgram/expandedGnuCParser.g:1293:9: warning:lexical nondeterminism between alts 1 and 2 of block upon
    [antlr] /home/jogamp/JogAmpSlavex32/workspace/gluegen/label/linux-x86_32-nvidia/build/gensrc/java/com/jogamp/gluegen/cgram/expandedGnuCParser.g:1293:9:     k==1:'1'
    [antlr] /home/jogamp/JogAmpSlavex32/workspace/gluegen/label/linux-x86_32-nvidia/build/gensrc/java/com/jogamp/gluegen/cgram/expandedGnuCParser.g:1293:9:     k==2:'\u0000'..'\u00ff'
    [antlr] /home/jogamp/JogAmpSlavex32/workspace/gluegen/label/linux-x86_32-nvidia/build/gensrc/java/com/jogamp/gluegen/cgram/expandedGnuCParser.g:1293:9:     k==3:<end-of-token>,'\u0000'..'\u00ff'
    [antlr] /home/jogamp/JogAmpSlavex32/workspace/gluegen/label/linux-x86_32-nvidia/build/gensrc/java/com/jogamp/gluegen/cgram/expandedGnuCParser.g:1294: warning:lexical nondeterminism upon
    [antlr] /home/jogamp/JogAmpSlavex32/workspace/gluegen/label/linux-x86_32-nvidia/build/gensrc/java/com/jogamp/gluegen/cgram/expandedGnuCParser.g:1294:     k==1:'\t','\u000c',' '
    [antlr] /home/jogamp/JogAmpSlavex32/workspace/gluegen/label/linux-x86_32-nvidia/build/gensrc/java/com/jogamp/gluegen/cgram/expandedGnuCParser.g:1294:     k==2:'\u0000'..'\u00ff'
    [antlr] /home/jogamp/JogAmpSlavex32/workspace/gluegen/label/linux-x86_32-nvidia/build/gensrc/java/com/jogamp/gluegen/cgram/expandedGnuCParser.g:1294:     k==3:<end-of-token>,'\u0000'..'\u00ff'
    [antlr] /home/jogamp/JogAmpSlavex32/workspace/gluegen/label/linux-x86_32-nvidia/build/gensrc/java/com/jogamp/gluegen/cgram/expandedGnuCParser.g:1294:     between alt 1 and exit branch of block
    [antlr] /home/jogamp/JogAmpSlavex32/workspace/gluegen/label/linux-x86_32-nvidia/build/gensrc/java/com/jogamp/gluegen/cgram/expandedGnuCParser.g:1295:9: warning:lexical nondeterminism between alts 1 and 2 of block upon
    [antlr] /home/jogamp/JogAmpSlavex32/workspace/gluegen/label/linux-x86_32-nvidia/build/gensrc/java/com/jogamp/gluegen/cgram/expandedGnuCParser.g:1295:9:     k==1:'2'
    [antlr] /home/jogamp/JogAmpSlavex32/workspace/gluegen/label/linux-x86_32-nvidia/build/gensrc/java/com/jogamp/gluegen/cgram/expandedGnuCParser.g:1295:9:     k==2:'\u0000'..'\u00ff'
    [antlr] /home/jogamp/JogAmpSlavex32/workspace/gluegen/label/linux-x86_32-nvidia/build/gensrc/java/com/jogamp/gluegen/cgram/expandedGnuCParser.g:1295:9:     k==3:<end-of-token>,'\u0000'..'\u00ff'
    [antlr] /home/jogamp/JogAmpSlavex32/workspace/gluegen/label/linux-x86_32-nvidia/build/gensrc/java/com/jogamp/gluegen/cgram/expandedGnuCParser.g:1296: warning:lexical nondeterminism upon
    [antlr] /home/jogamp/JogAmpSlavex32/workspace/gluegen/label/linux-x86_32-nvidia/build/gensrc/java/com/jogamp/gluegen/cgram/expandedGnuCParser.g:1296:     k==1:'\t','\u000c',' '
    [antlr] /home/jogamp/JogAmpSlavex32/workspace/gluegen/label/linux-x86_32-nvidia/build/gensrc/java/com/jogamp/gluegen/cgram/expandedGnuCParser.g:1296:     k==2:'\u0000'..'\u00ff'
    [antlr] /home/jogamp/JogAmpSlavex32/workspace/gluegen/label/linux-x86_32-nvidia/build/gensrc/java/com/jogamp/gluegen/cgram/expandedGnuCParser.g:1296:     k==3:<end-of-token>,'\u0000'..'\u00ff'
    [antlr] /home/jogamp/JogAmpSlavex32/workspace/gluegen/label/linux-x86_32-nvidia/build/gensrc/java/com/jogamp/gluegen/cgram/expandedGnuCParser.g:1296:     between alt 1 and exit branch of block
    [antlr] /home/jogamp/JogAmpSlavex32/workspace/gluegen/label/linux-x86_32-nvidia/build/gensrc/java/com/jogamp/gluegen/cgram/expandedGnuCParser.g:1297:9: warning:lexical nondeterminism between alts 1 and 2 of block upon
    [antlr] /home/jogamp/JogAmpSlavex32/workspace/gluegen/label/linux-x86_32-nvidia/build/gensrc/java/com/jogamp/gluegen/cgram/expandedGnuCParser.g:1297:9:     k==1:'3'
    [antlr] /home/jogamp/JogAmpSlavex32/workspace/gluegen/label/linux-x86_32-nvidia/build/gensrc/java/com/jogamp/gluegen/cgram/expandedGnuCParser.g:1297:9:     k==2:'\u0000'..'\u00ff'
    [antlr] /home/jogamp/JogAmpSlavex32/workspace/gluegen/label/linux-x86_32-nvidia/build/gensrc/java/com/jogamp/gluegen/cgram/expandedGnuCParser.g:1297:9:     k==3:<end-of-token>,'\u0000'..'\u00ff'
    [antlr] /home/jogamp/JogAmpSlavex32/workspace/gluegen/label/linux-x86_32-nvidia/build/gensrc/java/com/jogamp/gluegen/cgram/expandedGnuCParser.g:1298: warning:lexical nondeterminism upon
    [antlr] /home/jogamp/JogAmpSlavex32/workspace/gluegen/label/linux-x86_32-nvidia/build/gensrc/java/com/jogamp/gluegen/cgram/expandedGnuCParser.g:1298:     k==1:'\t','\u000c',' '
    [antlr] /home/jogamp/JogAmpSlavex32/workspace/gluegen/label/linux-x86_32-nvidia/build/gensrc/java/com/jogamp/gluegen/cgram/expandedGnuCParser.g:1298:     k==2:'\u0000'..'\u00ff'
    [antlr] /home/jogamp/JogAmpSlavex32/workspace/gluegen/label/linux-x86_32-nvidia/build/gensrc/java/com/jogamp/gluegen/cgram/expandedGnuCParser.g:1298:     k==3:<end-of-token>,'\u0000'..'\u00ff'
    [antlr] /home/jogamp/JogAmpSlavex32/workspace/gluegen/label/linux-x86_32-nvidia/build/gensrc/java/com/jogamp/gluegen/cgram/expandedGnuCParser.g:1298:     between alt 1 and exit branch of block
    [antlr] /home/jogamp/JogAmpSlavex32/workspace/gluegen/label/linux-x86_32-nvidia/build/gensrc/java/com/jogamp/gluegen/cgram/expandedGnuCParser.g:1299:9: warning:lexical nondeterminism between alts 1 and 2 of block upon
    [antlr] /home/jogamp/JogAmpSlavex32/workspace/gluegen/label/linux-x86_32-nvidia/build/gensrc/java/com/jogamp/gluegen/cgram/expandedGnuCParser.g:1299:9:     k==1:'4'
    [antlr] /home/jogamp/JogAmpSlavex32/workspace/gluegen/label/linux-x86_32-nvidia/build/gensrc/java/com/jogamp/gluegen/cgram/expandedGnuCParser.g:1299:9:     k==2:'\u0000'..'\u00ff'
    [antlr] /home/jogamp/JogAmpSlavex32/workspace/gluegen/label/linux-x86_32-nvidia/build/gensrc/java/com/jogamp/gluegen/cgram/expandedGnuCParser.g:1299:9:     k==3:<end-of-token>,'\u0000'..'\u00ff'
    [antlr] /home/jogamp/JogAmpSlavex32/workspace/gluegen/label/linux-x86_32-nvidia/build/gensrc/java/com/jogamp/gluegen/cgram/expandedGnuCParser.g:1265:5: warning:lexical nondeterminism between alts 1 and 2 of block upon
    [antlr] /home/jogamp/JogAmpSlavex32/workspace/gluegen/label/linux-x86_32-nvidia/build/gensrc/java/com/jogamp/gluegen/cgram/expandedGnuCParser.g:1265:5:     k==1:'\t','\u000c',' ','%','*','+','-','/','<','>'
    [antlr] /home/jogamp/JogAmpSlavex32/workspace/gluegen/label/linux-x86_32-nvidia/build/gensrc/java/com/jogamp/gluegen/cgram/expandedGnuCParser.g:1265:5:     k==2:'\t','\u000c',' ','%','(','*','+','-'..'9','<','>'
    [antlr] /home/jogamp/JogAmpSlavex32/workspace/gluegen/label/linux-x86_32-nvidia/build/gensrc/java/com/jogamp/gluegen/cgram/expandedGnuCParser.g:1265:5:     k==3:<end-of-token>,'\u0000'..'\u00ff'
    [antlr] /home/jogamp/JogAmpSlavex32/workspace/gluegen/label/linux-x86_32-nvidia/build/gensrc/java/com/jogamp/gluegen/cgram/expandedGnuCParser.g:132: warning:nondeterminism upon
    [antlr] /home/jogamp/JogAmpSlavex32/workspace/gluegen/label/linux-x86_32-nvidia/build/gensrc/java/com/jogamp/gluegen/cgram/expandedGnuCParser.g:132:     k==1:SEMI
    [antlr] /home/jogamp/JogAmpSlavex32/workspace/gluegen/label/linux-x86_32-nvidia/build/gensrc/java/com/jogamp/gluegen/cgram/expandedGnuCParser.g:132:     k==2:EOF,"typedef","asm","volatile",SEMI,"struct","union","enum","auto","register","extern","static","const","void","char","short","int","long","float","double","signed","unsigned","__int32","int32_t","wchar_t","uint32_t","__int64","int64_t","uint64_t","ptrdiff_t","intptr_t","size_t","uintptr_t",ID,STAR,LPAREN,"inline","typeof","__complex"
    [antlr] /home/jogamp/JogAmpSlavex32/workspace/gluegen/label/linux-x86_32-nvidia/build/gensrc/java/com/jogamp/gluegen/cgram/expandedGnuCParser.g:132:     between alt 1 and exit branch of block
    [antlr] /home/jogamp/JogAmpSlavex32/workspace/gluegen/label/linux-x86_32-nvidia/build/gensrc/java/com/jogamp/gluegen/cgram/expandedGnuCParser.g:245: warning:nondeterminism upon
    [antlr] /home/jogamp/JogAmpSlavex32/workspace/gluegen/label/linux-x86_32-nvidia/build/gensrc/java/com/jogamp/gluegen/cgram/expandedGnuCParser.g:245:     k==1:SEMI
    [antlr] /home/jogamp/JogAmpSlavex32/workspace/gluegen/label/linux-x86_32-nvidia/build/gensrc/java/com/jogamp/gluegen/cgram/expandedGnuCParser.g:245:     k==2:EOF,"typedef","asm","volatile",LCURLY,RCURLY,SEMI,"struct","union","enum","auto","register","extern","static","const","void","char","short","int","long","float","double","signed","unsigned","__int32","int32_t","wchar_t","uint32_t","__int64","int64_t","uint64_t","ptrdiff_t","intptr_t","size_t","uintptr_t",ID,STAR,LPAREN,VARARGS,"while","do","for","goto","continue","break","return","case","default","if","switch",LAND,BAND,PLUS,MINUS,INC,DEC,"sizeof",BNOT,LNOT,CharLiteral,StringLiteral,Number,"__label__","inline","typeof","__complex","__alignof","__real","__imag"
    [antlr] /home/jogamp/JogAmpSlavex32/workspace/gluegen/label/linux-x86_32-nvidia/build/gensrc/java/com/jogamp/gluegen/cgram/expandedGnuCParser.g:245:     between alt 1 and exit branch of block
    [antlr] /home/jogamp/JogAmpSlavex32/workspace/gluegen/label/linux-x86_32-nvidia/build/gensrc/java/com/jogamp/gluegen/cgram/expandedGnuCParser.g:658: warning:nondeterminism between alts 1 and 4 of block upon
    [antlr] /home/jogamp/JogAmpSlavex32/workspace/gluegen/label/linux-x86_32-nvidia/build/gensrc/java/com/jogamp/gluegen/cgram/expandedGnuCParser.g:658:     k==1:"struct"
    [antlr] /home/jogamp/JogAmpSlavex32/workspace/gluegen/label/linux-x86_32-nvidia/build/gensrc/java/com/jogamp/gluegen/cgram/expandedGnuCParser.g:658:     k==2:
    [antlr] /home/jogamp/JogAmpSlavex32/workspace/gluegen/label/linux-x86_32-nvidia/build/gensrc/java/com/jogamp/gluegen/cgram/expandedGnuCParser.g:658: warning:nondeterminism between alts 2 and 4 of block upon
    [antlr] /home/jogamp/JogAmpSlavex32/workspace/gluegen/label/linux-x86_32-nvidia/build/gensrc/java/com/jogamp/gluegen/cgram/expandedGnuCParser.g:658:     k==1:"union"
    [antlr] /home/jogamp/JogAmpSlavex32/workspace/gluegen/label/linux-x86_32-nvidia/build/gensrc/java/com/jogamp/gluegen/cgram/expandedGnuCParser.g:658:     k==2:
    [antlr] /home/jogamp/JogAmpSlavex32/workspace/gluegen/label/linux-x86_32-nvidia/build/gensrc/java/com/jogamp/gluegen/cgram/expandedGnuCParser.g:658: warning:nondeterminism between alts 3 and 4 of block upon
    [antlr] /home/jogamp/JogAmpSlavex32/workspace/gluegen/label/linux-x86_32-nvidia/build/gensrc/java/com/jogamp/gluegen/cgram/expandedGnuCParser.g:658:     k==1:"enum"
    [antlr] /home/jogamp/JogAmpSlavex32/workspace/gluegen/label/linux-x86_32-nvidia/build/gensrc/java/com/jogamp/gluegen/cgram/expandedGnuCParser.g:658:     k==2:
    [antlr] /home/jogamp/JogAmpSlavex32/workspace/gluegen/label/linux-x86_32-nvidia/build/gensrc/java/com/jogamp/gluegen/cgram/expandedGnuCParser.g:158:14: warning:nondeterminism between alts 1 and 2 of block upon
    [antlr] /home/jogamp/JogAmpSlavex32/workspace/gluegen/label/linux-x86_32-nvidia/build/gensrc/java/com/jogamp/gluegen/cgram/expandedGnuCParser.g:158:14:     k==1:LCURLY
    [antlr] /home/jogamp/JogAmpSlavex32/workspace/gluegen/label/linux-x86_32-nvidia/build/gensrc/java/com/jogamp/gluegen/cgram/expandedGnuCParser.g:158:14:     k==2:"asm",LCURLY,RCURLY,ID,STAR,LPAREN,LBRACKET,LAND,BAND,PLUS,MINUS,INC,DEC,"sizeof",BNOT,LNOT,DOT,CharLiteral,StringLiteral,Number,"__alignof","__real","__imag"
    [antlr] /home/jogamp/JogAmpSlavex32/workspace/gluegen/label/linux-x86_32-nvidia/build/gensrc/java/com/jogamp/gluegen/cgram/expandedGnuCParser.g:556: warning:nondeterminism between alts 1 and 4 of block upon
    [antlr] /home/jogamp/JogAmpSlavex32/workspace/gluegen/label/linux-x86_32-nvidia/build/gensrc/java/com/jogamp/gluegen/cgram/expandedGnuCParser.g:556:     k==1:"struct"
    [antlr] /home/jogamp/JogAmpSlavex32/workspace/gluegen/label/linux-x86_32-nvidia/build/gensrc/java/com/jogamp/gluegen/cgram/expandedGnuCParser.g:556:     k==2:
    [antlr] /home/jogamp/JogAmpSlavex32/workspace/gluegen/label/linux-x86_32-nvidia/build/gensrc/java/com/jogamp/gluegen/cgram/expandedGnuCParser.g:556: warning:nondeterminism between alts 2 and 4 of block upon
    [antlr] /home/jogamp/JogAmpSlavex32/workspace/gluegen/label/linux-x86_32-nvidia/build/gensrc/java/com/jogamp/gluegen/cgram/expandedGnuCParser.g:556:     k==1:"union"
    [antlr] /home/jogamp/JogAmpSlavex32/workspace/gluegen/label/linux-x86_32-nvidia/build/gensrc/java/com/jogamp/gluegen/cgram/expandedGnuCParser.g:556:     k==2:
    [antlr] /home/jogamp/JogAmpSlavex32/workspace/gluegen/label/linux-x86_32-nvidia/build/gensrc/java/com/jogamp/gluegen/cgram/expandedGnuCParser.g:556: warning:nondeterminism between alts 3 and 4 of block upon
    [antlr] /home/jogamp/JogAmpSlavex32/workspace/gluegen/label/linux-x86_32-nvidia/build/gensrc/java/com/jogamp/gluegen/cgram/expandedGnuCParser.g:556:     k==1:"enum"
    [antlr] /home/jogamp/JogAmpSlavex32/workspace/gluegen/label/linux-x86_32-nvidia/build/gensrc/java/com/jogamp/gluegen/cgram/expandedGnuCParser.g:556:     k==2:
    [antlr] /home/jogamp/JogAmpSlavex32/workspace/gluegen/label/linux-x86_32-nvidia/build/gensrc/java/com/jogamp/gluegen/cgram/expandedGnuCParser.g:220:17: warning:nondeterminism between alts 1 and 2 of block upon
    [antlr] /home/jogamp/JogAmpSlavex32/workspace/gluegen/label/linux-x86_32-nvidia/build/gensrc/java/com/jogamp/gluegen/cgram/expandedGnuCParser.g:220:17:     k==1:COMMA
    [antlr] /home/jogamp/JogAmpSlavex32/workspace/gluegen/label/linux-x86_32-nvidia/build/gensrc/java/com/jogamp/gluegen/cgram/expandedGnuCParser.g:220:17:     k==2:VARARGS
    [antlr] /home/jogamp/JogAmpSlavex32/workspace/gluegen/label/linux-x86_32-nvidia/build/gensrc/java/com/jogamp/gluegen/cgram/expandedGnuCParser.g:236: warning:nondeterminism upon
    [antlr] /home/jogamp/JogAmpSlavex32/workspace/gluegen/label/linux-x86_32-nvidia/build/gensrc/java/com/jogamp/gluegen/cgram/expandedGnuCParser.g:236:     k==1:SEMI
    [antlr] /home/jogamp/JogAmpSlavex32/workspace/gluegen/label/linux-x86_32-nvidia/build/gensrc/java/com/jogamp/gluegen/cgram/expandedGnuCParser.g:236:     k==2:"typedef","asm","volatile",LCURLY,RCURLY,SEMI,"struct","union","enum","auto","register","extern","static","const","void","char","short","int","long","float","double","signed","unsigned","__int32","int32_t","wchar_t","uint32_t","__int64","int64_t","uint64_t","ptrdiff_t","intptr_t","size_t","uintptr_t",ID,STAR,LPAREN,"while","do","for","goto","continue","break","return","case","default","if","switch",LAND,BAND,PLUS,MINUS,INC,DEC,"sizeof",BNOT,LNOT,CharLiteral,StringLiteral,Number,"__label__","inline","typeof","__complex","__alignof","__real","__imag"
    [antlr] /home/jogamp/JogAmpSlavex32/workspace/gluegen/label/linux-x86_32-nvidia/build/gensrc/java/com/jogamp/gluegen/cgram/expandedGnuCParser.g:236:     between alt 1 and exit branch of block
    [antlr] /home/jogamp/JogAmpSlavex32/workspace/gluegen/label/linux-x86_32-nvidia/build/gensrc/java/com/jogamp/gluegen/cgram/expandedGnuCParser.g:593: warning:nondeterminism between alts 1 and 4 of block upon
    [antlr] /home/jogamp/JogAmpSlavex32/workspace/gluegen/label/linux-x86_32-nvidia/build/gensrc/java/com/jogamp/gluegen/cgram/expandedGnuCParser.g:593:     k==1:"struct"
    [antlr] /home/jogamp/JogAmpSlavex32/workspace/gluegen/label/linux-x86_32-nvidia/build/gensrc/java/com/jogamp/gluegen/cgram/expandedGnuCParser.g:593:     k==2:
    [antlr] /home/jogamp/JogAmpSlavex32/workspace/gluegen/label/linux-x86_32-nvidia/build/gensrc/java/com/jogamp/gluegen/cgram/expandedGnuCParser.g:593: warning:nondeterminism between alts 2 and 4 of block upon
    [antlr] /home/jogamp/JogAmpSlavex32/workspace/gluegen/label/linux-x86_32-nvidia/build/gensrc/java/com/jogamp/gluegen/cgram/expandedGnuCParser.g:593:     k==1:"union"
    [antlr] /home/jogamp/JogAmpSlavex32/workspace/gluegen/label/linux-x86_32-nvidia/build/gensrc/java/com/jogamp/gluegen/cgram/expandedGnuCParser.g:593:     k==2:
    [antlr] /home/jogamp/JogAmpSlavex32/workspace/gluegen/label/linux-x86_32-nvidia/build/gensrc/java/com/jogamp/gluegen/cgram/expandedGnuCParser.g:593: warning:nondeterminism between alts 3 and 4 of block upon
    [antlr] /home/jogamp/JogAmpSlavex32/workspace/gluegen/label/linux-x86_32-nvidia/build/gensrc/java/com/jogamp/gluegen/cgram/expandedGnuCParser.g:593:     k==1:"enum"
    [antlr] /home/jogamp/JogAmpSlavex32/workspace/gluegen/label/linux-x86_32-nvidia/build/gensrc/java/com/jogamp/gluegen/cgram/expandedGnuCParser.g:593:     k==2:
    [antlr] /home/jogamp/JogAmpSlavex32/workspace/gluegen/label/linux-x86_32-nvidia/build/gensrc/java/com/jogamp/gluegen/cgram/expandedGnuCParser.g:321:21: warning:Rule 'declarator' returns a value

generate.grammar:
    [antlr] ANTLR Parser Generator   Version 2.7.7 (2006-11-01)   1989-2005

generate.c.grammar.glib:
    [antlr] ANTLR Parser Generator   Version 2.7.7 (2006-11-01)   1989-2005

generate.c.grammar.glib:
    [antlr] ANTLR Parser Generator   Version 2.7.7 (2006-11-01)   1989-2005
    [antlr] warning: rule HeaderParser.declSpecifiers has different signature than GnuCTreeParser.declSpecifiers
    [antlr] warning: rule HeaderParser.storageClassSpecifier has different signature than GnuCTreeParser.storageClassSpecifier
    [antlr] warning: rule HeaderParser.functionStorageClassSpecifier has different signature than GnuCTreeParser.functionStorageClassSpecifier
    [antlr] warning: rule HeaderParser.typeQualifier has different signature than GnuCTreeParser.typeQualifier
    [antlr] warning: rule HeaderParser.typeSpecifier has different signature than GnuCTreeParser.typeSpecifier
    [antlr] warning: rule HeaderParser.typedefName has different signature than GnuCTreeParser.typedefName
    [antlr] warning: rule HeaderParser.structSpecifier has different signature than GnuCTreeParser.structSpecifier
    [antlr] warning: rule HeaderParser.unionSpecifier has different signature than GnuCTreeParser.unionSpecifier
    [antlr] warning: rule HeaderParser.structOrUnionBody has different signature than GnuCTreeParser.structOrUnionBody
    [antlr] warning: rule HeaderParser.structDeclarationList has different signature than GnuCTreeParser.structDeclarationList
    [antlr] warning: rule HeaderParser.structDeclaration has different signature than GnuCTreeParser.structDeclaration
    [antlr] warning: rule HeaderParser.specifierQualifierList has different signature than GnuCTreeParser.specifierQualifierList
    [antlr] warning: rule HeaderParser.structDeclaratorList has different signature than GnuCTreeParser.structDeclaratorList
    [antlr] warning: rule HeaderParser.structDeclarator has different signature than GnuCTreeParser.structDeclarator
    [antlr] warning: rule HeaderParser.enumSpecifier has different signature than GnuCTreeParser.enumSpecifier
    [antlr] warning: rule HeaderParser.enumList has different signature than GnuCTreeParser.enumList
    [antlr] warning: rule HeaderParser.enumerator has different signature than GnuCTreeParser.enumerator
    [antlr] warning: rule HeaderParser.initDeclList has different signature than GnuCTreeParser.initDeclList
    [antlr] warning: rule HeaderParser.initDecl has different signature than GnuCTreeParser.initDecl
    [antlr] warning: rule HeaderParser.pointerGroup has different signature than GnuCTreeParser.pointerGroup
    [antlr] warning: rule HeaderParser.declarator has different signature than GnuCTreeParser.declarator
    [antlr] warning: rule HeaderParser.parameterTypeList has different signature than GnuCTreeParser.parameterTypeList
    [antlr] warning: rule HeaderParser.parameterDeclaration has different signature than GnuCTreeParser.parameterDeclaration
    [antlr] warning: rule HeaderParser.nonemptyAbstractDeclarator has different signature than GnuCTreeParser.nonemptyAbstractDeclarator
    [antlr] /home/jogamp/JogAmpSlavex32/workspace/gluegen/label/linux-x86_32-nvidia/build/gensrc/java/com/jogamp/gluegen/cgram/expandedHeaderParser.g:702:27: warning:Rule 'parameterTypeList' returns a value
    [antlr] /home/jogamp/JogAmpSlavex32/workspace/gluegen/label/linux-x86_32-nvidia/build/gensrc/java/com/jogamp/gluegen/cgram/expandedHeaderParser.g:710:27: warning:Rule 'parameterTypeList' returns a value
    [antlr] /home/jogamp/JogAmpSlavex32/workspace/gluegen/label/linux-x86_32-nvidia/build/gensrc/java/com/jogamp/gluegen/cgram/expandedHeaderParser.g:412:17: warning:Rule 'declarator' returns a value
    [antlr] /home/jogamp/JogAmpSlavex32/workspace/gluegen/label/linux-x86_32-nvidia/build/gensrc/java/com/jogamp/gluegen/cgram/expandedHeaderParser.g:686:27: warning:Rule 'functionStorageClassSpecifier' returns a value
    [antlr] /home/jogamp/JogAmpSlavex32/workspace/gluegen/label/linux-x86_32-nvidia/build/gensrc/java/com/jogamp/gluegen/cgram/expandedHeaderParser.g:687:19: warning:Rule 'typeQualifier' returns a value
    [antlr] /home/jogamp/JogAmpSlavex32/workspace/gluegen/label/linux-x86_32-nvidia/build/gensrc/java/com/jogamp/gluegen/cgram/expandedHeaderParser.g:688:19: warning:Rule 'typeSpecifier' returns a value
    [antlr] /home/jogamp/JogAmpSlavex32/workspace/gluegen/label/linux-x86_32-nvidia/build/gensrc/java/com/jogamp/gluegen/cgram/expandedHeaderParser.g:695:2: warning:Rule 'specifierQualifierList' returns a value

generate.grammar:
    [antlr] ANTLR Parser Generator   Version 2.7.7 (2006-11-01)   1989-2005
    [javac] Compiling 42 source files to /home/jogamp/JogAmpSlavex32/workspace/gluegen/label/linux-x86_32-nvidia/build/classes
    [javac] Note: Some input files use unchecked or unsafe operations.
    [javac] Note: Recompile with -Xlint:unchecked for details.
    [javac] Compiling 74 source files to /home/jogamp/JogAmpSlavex32/workspace/gluegen/label/linux-x86_32-nvidia/build/classes
    [javac] Note: /home/jogamp/JogAmpSlavex32/workspace/gluegen/label/linux-x86_32-nvidia/src/java/com/jogamp/gluegen/ant/GlueGenTask.java uses or overrides a deprecated API.
    [javac] Note: Recompile with -Xlint:deprecation for details.
    [javac] Note: Some input files use unchecked or unsafe operations.
    [javac] Note: Recompile with -Xlint:unchecked for details.
     [copy] Copying 1 file to /home/jogamp/JogAmpSlavex32/workspace/gluegen/label/linux-x86_32-nvidia/build
      [jar] Building jar: /home/jogamp/JogAmpSlavex32/workspace/gluegen/label/linux-x86_32-nvidia/build/gluegen.jar
     [copy] Copying 1 file to /home/jogamp/JogAmpSlavex32/workspace/gluegen/label/linux-x86_32-nvidia/build

jogamp.env.init:

gluegen.properties.load.user:

gluegen.cpptasks.initialize:

gluegen.cpptasks.detect.os.1:

gluegen.cpptasks.detect.os.freebsd.amd64:

gluegen.cpptasks.detect.os.freebsd.x86:

gluegen.cpptasks.detect.os.freebsd:

gluegen.cpptasks.detect.os.hpux:

gluegen.cpptasks.detect.os.linux.amd64:

gluegen.cpptasks.detect.os.linux.ia64:

gluegen.cpptasks.detect.os.linux.x86:

gluegen.cpptasks.detect.os.linux:

gluegen.cpptasks.detect.os.osx:

gluegen.cpptasks.detect.os.solaris.sparc:

gluegen.cpptasks.detect.os.solaris.sparcv9:

gluegen.cpptasks.detect.os.solaris.amd64:

gluegen.cpptasks.detect.os.solaris.x86:

gluegen.cpptasks.detect.os.solaris:

gluegen.cpptasks.detect.os.unix:

gluegen.cpptasks.detect.os.windows.amd64:

gluegen.cpptasks.detect.os.windows.x86:

gluegen.cpptasks.detect.os.windows:

gluegen.cpptasks.detect.os.2:

gluegen.cpptasks.detect.os:

setup-excludes-1:

setup-excludes-2:

init:

java.class.path.validate:

validate:

gluegen.cpptasks.detect.compiler:
     [echo] VC6=${isVC6}
     [echo] VC7=${isVC7}
     [echo] VC8=${isVC8}
     [echo] VC8_X64=${isVC8_X64}
     [echo] VC9=${isVC9}
     [echo] MingW=${isMingW}
     [echo] MingW32=${isMingW32}
     [echo] MingW64=${isMingW64}

setup.java.home.dir.nonmacosx:

setup.java.home.dir.macosx:

setup.java.home.dir:

declare.win32.vc6:

declare.win32.vc7:

declare.win32.vc8:

declare.win32.vc8_x64:

declare.win32.vc9:

declare.win32.mingw:

declare.win64.mingw:

declare.win32:

declare.linux.x86:
     [echo] Linux.x86

declare.linux.amd64:

declare.linux.ia64:

declare.linux:

declare.solaris32:

declare.solarisSparcv9:

declare.solarisAMD64:

declare.solaris:

declare.macosx:

declare.freebsd.x86:

declare.freebsd.amd64:

declare.freebsd:

declare.hpux:

gluegen.cpptasks.configure.compiler:

c.configure:

c.build:
     [echo] Output lib name = gluegen-rt
    [mkdir] Created dir: /home/jogamp/JogAmpSlavex32/workspace/gluegen/label/linux-x86_32-nvidia/build/obj
     [echo] Compiling src/native/unix/*.c src/native/common/*.c
     [echo] user.dir=/home/jogamp/JogAmpSlavex32/workspace/gluegen/label/linux-x86_32-nvidia/make
       [cc] 4 total files to be compiled.
       [cc] cc1: warning: command line option "-fno-rtti" is valid for C++/ObjC++ but not for C
       [cc] cc1: warning: command line option "-fno-rtti" is valid for C++/ObjC++ but not for C
       [cc] cc1: warning: command line option "-fno-rtti" is valid for C++/ObjC++ but not for C
       [cc] /home/jogamp/JogAmpSlavex32/workspace/gluegen/label/linux-x86_32-nvidia/src/native/common/PointerBuffer.c: In function ‘Java_com_jogamp_common_nio_PointerBuffer_getDirectBufferAddressImpl’:
       [cc] /home/jogamp/JogAmpSlavex32/workspace/gluegen/label/linux-x86_32-nvidia/src/native/common/PointerBuffer.c:8: warning: cast from pointer to integer of different size
       [cc] cc1: warning: command line option "-fno-rtti" is valid for C++/ObjC++ but not for C
       [cc] Starting link

c.rename.lib.mingw:

c.rename.lib.macosx:

gluegen.properties.load.user:

gluegen.cpptasks.initialize:

gluegen.cpptasks.striplibs:
     [echo] Strip symbols from libs in /home/jogamp/JogAmpSlavex32/workspace/gluegen/label/linux-x86_32-nvidia/build/obj

c.manifest:
      [jar] Building jar: /home/jogamp/JogAmpSlavex32/workspace/gluegen/label/linux-x86_32-nvidia/build/gluegen-rt.jar
      [jar] Building jar: /home/jogamp/JogAmpSlavex32/workspace/gluegen/label/linux-x86_32-nvidia/build/gluegen-rt-natives-linux-i586.jar
     [copy] Copying 1 file to /home/jogamp/JogAmpSlavex32/workspace/gluegen/label/linux-x86_32-nvidia/build
     [copy] Copying 1 file to /home/jogamp/JogAmpSlavex32/workspace/gluegen/label/linux-x86_32-nvidia/build

tag.build:

base.compile:

junit.compile:

jogamp.env.init:

gluegen.properties.load.user:

init:

java.class.path.validate:

validate:
    [mkdir] Created dir: /home/jogamp/JogAmpSlavex32/workspace/gluegen/label/linux-x86_32-nvidia/build/test
    [mkdir] Created dir: /home/jogamp/JogAmpSlavex32/workspace/gluegen/label/linux-x86_32-nvidia/build/test/results
    [mkdir] Created dir: /home/jogamp/JogAmpSlavex32/workspace/gluegen/label/linux-x86_32-nvidia/build/test/build
    [mkdir] Created dir: /home/jogamp/JogAmpSlavex32/workspace/gluegen/label/linux-x86_32-nvidia/build/test/build/gensrc
    [mkdir] Created dir: /home/jogamp/JogAmpSlavex32/workspace/gluegen/label/linux-x86_32-nvidia/build/test/build/classes
    [mkdir] Created dir: /home/jogamp/JogAmpSlavex32/workspace/gluegen/label/linux-x86_32-nvidia/build/test/build/obj
    [mkdir] Created dir: /home/jogamp/JogAmpSlavex32/workspace/gluegen/label/linux-x86_32-nvidia/build/test/build/natives
     [echo] test.base.dir: ../src/junit 
     [echo] test.junit.generation.dir: ../src/junit/com/jogamp/gluegen/test/junit/generation 
     [echo] test.dir: ../build/test 
     [echo] results: ../build/test/results 
     [echo] build_t: ../build/test/build 
     [echo] build_t.gen: ../build/test/build/gensrc 
     [echo] build_t.java: ../build/test/build/classes 
     [echo] build_t.obj: ../build/test/build/obj 
     [echo] build_t.lib: ../build/test/build/natives 

junit.compile.check:

junit.compile:

junit.test1.java.generate:
     [echo]  - - - junit.test1.java.generate
  [gluegen] [WARNING com.jogamp.gluegen.pcpp.PCPP]: #warning "Hello GlueGen" at "../src/junit/com/jogamp/gluegen/test/junit/generation/test1.h" line "117"
  [gluegen] [WARNING com.jogamp.gluegen.JavaEmitter]: skipping emission of unnamed struct "struct __MYAPIConfig"
  [gluegen] [WARNING com.jogamp.gluegen.JavaEmitter]: skipping emission of unnamed struct "struct __MYAPIConfig"
  [gluegen] [WARNING com.jogamp.gluegen.JavaEmitter]: skipping emission of unnamed struct "struct __MYAPIConfig"
  [gluegen] [WARNING com.jogamp.gluegen.pcpp.PCPP]: #warning "Hello GlueGen" at "../src/junit/com/jogamp/gluegen/test/junit/generation/test1.h" line "117"
  [gluegen] [WARNING com.jogamp.gluegen.JavaEmitter]: skipping emission of unnamed struct "struct __MYAPIConfig"
  [gluegen] [WARNING com.jogamp.gluegen.JavaEmitter]: skipping emission of unnamed struct "struct __MYAPIConfig"
  [gluegen] [WARNING com.jogamp.gluegen.JavaEmitter]: skipping emission of unnamed struct "struct __MYAPIConfig"
  [gluegen] [WARNING com.jogamp.gluegen.pcpp.PCPP]: #warning "Hello GlueGen" at "../src/junit/com/jogamp/gluegen/test/junit/generation/test1.h" line "117"
  [gluegen] [WARNING com.jogamp.gluegen.JavaEmitter]: skipping emission of unnamed struct "struct __MYAPIConfig"
  [gluegen] [WARNING com.jogamp.gluegen.JavaEmitter]: skipping emission of unnamed struct "struct __MYAPIConfig"
  [gluegen] [WARNING com.jogamp.gluegen.JavaEmitter]: skipping emission of unnamed struct "struct __MYAPIConfig"

java.generate:

junit.test1.java.generate:
     [echo]  - - - junit.test1.java.generate
  [gluegen] [WARNING com.jogamp.gluegen.pcpp.PCPP]: #warning "Hello GlueGen" at "../src/junit/com/jogamp/gluegen/test/junit/generation/test1.h" line "117"
  [gluegen] [WARNING com.jogamp.gluegen.JavaEmitter]: skipping emission of unnamed struct "struct __MYAPIConfig"
  [gluegen] [WARNING com.jogamp.gluegen.JavaEmitter]: skipping emission of unnamed struct "struct __MYAPIConfig"
  [gluegen] [WARNING com.jogamp.gluegen.JavaEmitter]: skipping emission of unnamed struct "struct __MYAPIConfig"
  [gluegen] [WARNING com.jogamp.gluegen.pcpp.PCPP]: #warning "Hello GlueGen" at "../src/junit/com/jogamp/gluegen/test/junit/generation/test1.h" line "117"
  [gluegen] [WARNING com.jogamp.gluegen.JavaEmitter]: skipping emission of unnamed struct "struct __MYAPIConfig"
  [gluegen] [WARNING com.jogamp.gluegen.JavaEmitter]: skipping emission of unnamed struct "struct __MYAPIConfig"
  [gluegen] [WARNING com.jogamp.gluegen.JavaEmitter]: skipping emission of unnamed struct "struct __MYAPIConfig"
  [gluegen] [WARNING com.jogamp.gluegen.pcpp.PCPP]: #warning "Hello GlueGen" at "../src/junit/com/jogamp/gluegen/test/junit/generation/test1.h" line "117"
  [gluegen] [WARNING com.jogamp.gluegen.JavaEmitter]: skipping emission of unnamed struct "struct __MYAPIConfig"
  [gluegen] [WARNING com.jogamp.gluegen.JavaEmitter]: skipping emission of unnamed struct "struct __MYAPIConfig"
  [gluegen] [WARNING com.jogamp.gluegen.JavaEmitter]: skipping emission of unnamed struct "struct __MYAPIConfig"

java.generate:

java.build:
     [echo]  - - - compiling all java files - - - 
     [echo]  test.base.dir ../src/junit
     [echo]  build_t.gen     ../build/test/build/gensrc
    [javac] Compiling 23 source files to /home/jogamp/JogAmpSlavex32/workspace/gluegen/label/linux-x86_32-nvidia/build/test/build/classes
    [javac] Note: Some input files use unchecked or unsafe operations.
    [javac] Note: Recompile with -Xlint:unchecked for details.
      [jar] Building jar: /home/jogamp/JogAmpSlavex32/workspace/gluegen/label/linux-x86_32-nvidia/build/test/build/gluegen-test.jar

gluegen.properties.load.user:

gluegen.cpptasks.initialize:

gluegen.cpptasks.detect.os.1:

gluegen.cpptasks.detect.os.freebsd.amd64:

gluegen.cpptasks.detect.os.freebsd.x86:

gluegen.cpptasks.detect.os.freebsd:

gluegen.cpptasks.detect.os.hpux:

gluegen.cpptasks.detect.os.linux.amd64:

gluegen.cpptasks.detect.os.linux.ia64:

gluegen.cpptasks.detect.os.linux.x86:

gluegen.cpptasks.detect.os.linux:

gluegen.cpptasks.detect.os.osx:

gluegen.cpptasks.detect.os.solaris.sparc:

gluegen.cpptasks.detect.os.solaris.sparcv9:

gluegen.cpptasks.detect.os.solaris.amd64:

gluegen.cpptasks.detect.os.solaris.x86:

gluegen.cpptasks.detect.os.solaris:

gluegen.cpptasks.detect.os.unix:

gluegen.cpptasks.detect.os.windows.amd64:

gluegen.cpptasks.detect.os.windows.x86:

gluegen.cpptasks.detect.os.windows:

gluegen.cpptasks.detect.os.2:

gluegen.cpptasks.detect.os:

gluegen.cpptasks.detect.compiler:
     [echo] VC6=${isVC6}
     [echo] VC7=${isVC7}
     [echo] VC8=${isVC8}
     [echo] VC8_X64=${isVC8_X64}
     [echo] VC9=${isVC9}
     [echo] MingW=${isMingW}
     [echo] MingW32=${isMingW32}
     [echo] MingW64=${isMingW64}

setup.java.home.dir.nonmacosx:

setup.java.home.dir.macosx:

setup.java.home.dir:

gluegen.cpptasks.configure.compiler:

gluegen.cpptasks.declare.compiler.win32.vc6:

gluegen.cpptasks.declare.compiler.win32.vc7:

gluegen.cpptasks.declare.compiler.win32.vc8:

gluegen.cpptasks.declare.compiler.win32.vc8_x64:

gluegen.cpptasks.declare.compiler.win32.vc9:

gluegen.cpptasks.declare.compiler.win32.mingw:

gluegen.cpptasks.declare.compiler.win64.mingw:

gluegen.cpptasks.declare.compiler.win32:

gluegen.cpptasks.declare.compiler.linux.x86:
     [echo] Linux.x86

gluegen.cpptasks.declare.compiler.linux.amd64:

gluegen.cpptasks.declare.compiler.linux.ia64:

gluegen.cpptasks.declare.compiler.linux:

gluegen.cpptasks.declare.compiler.solaris32:

gluegen.cpptasks.declare.compiler.solaris.sparcv9:

gluegen.cpptasks.declare.compiler.solaris.amd64:

gluegen.cpptasks.declare.compiler.solaris:

gluegen.cpptasks.declare.compiler.macosx:

gluegen.cpptasks.declare.compiler.freebsd.x86:

gluegen.cpptasks.declare.compiler.freebsd.amd64:

gluegen.cpptasks.declare.compiler.freebsd:

gluegen.cpptasks.declare.compiler.hpux:

gluegen.cpptasks.declare.compiler:

gluegen.cpptasks.setup.compiler:

c.configure:

junit.test1i.c.build:
     [echo] Compiling test1
     [echo]    c.compiler.src.files junit.test1i.c.src.files
     [echo]    compiler.cfg.id compiler.cfg.linux
     [echo]    linker.cfg.id linker.test1.dll.cfg.id
     [echo]    output.lib.name test1
       [cc] 1 total files to be compiled.
       [cc] cc1: warning: command line option "-fno-rtti" is valid for C++/ObjC++ but not for C
       [cc] In file included from /home/jogamp/JogAmpSlavex32/workspace/gluegen/label/linux-x86_32-nvidia/src/junit/com/jogamp/gluegen/test/junit/generation/test1.c:2:
       [cc] /home/jogamp/JogAmpSlavex32/workspace/gluegen/label/linux-x86_32-nvidia/src/junit/com/jogamp/gluegen/test/junit/generation/test1.h:119:6: warning: #warning "Hello Native Compiler"
       [cc] Starting link

junit.test1p1.c.build:
     [echo] Compiling Bindingtest1p1
     [echo]    c.compiler.src.files junit.test1p1.c.src.files
     [echo]    compiler.cfg.id compiler.cfg.linux
     [echo]    linker.cfg.id linker.test1.fixed.cfg.id
     [echo]    output.lib.name Bindingtest1p1
       [cc] 1 total files to be compiled.
       [cc] cc1: warning: command line option "-fno-rtti" is valid for C++/ObjC++ but not for C
       [cc] In file included from /home/jogamp/JogAmpSlavex32/workspace/gluegen/label/linux-x86_32-nvidia/build/test/build/gensrc/native/Bindingtest1p1Impl_JNI.c:8:
       [cc] /home/jogamp/JogAmpSlavex32/workspace/gluegen/label/linux-x86_32-nvidia/src/junit/com/jogamp/gluegen/test/junit/generation/test1.h:119:6: warning: #warning "Hello Native Compiler"
       [cc] Starting link

rename.dylib:

junit.test1p2.c.build:
     [echo] Compiling Bindingtest1p2
     [echo]    c.compiler.src.files junit.test1p2.c.src.files
     [echo]    compiler.cfg.id compiler.cfg.linux
     [echo]    linker.cfg.id linker.test1.runtime.cfg.id
     [echo]    output.lib.name Bindingtest1p2
       [cc] 1 total files to be compiled.
       [cc] cc1: warning: command line option "-fno-rtti" is valid for C++/ObjC++ but not for C
       [cc] In file included from /home/jogamp/JogAmpSlavex32/workspace/gluegen/label/linux-x86_32-nvidia/build/test/build/gensrc/native/Bindingtest1p2Impl_JNI.c:8:
       [cc] /home/jogamp/JogAmpSlavex32/workspace/gluegen/label/linux-x86_32-nvidia/src/junit/com/jogamp/gluegen/test/junit/generation/test1.h:119:6: warning: #warning "Hello Native Compiler"
       [cc] Starting link

rename.dylib:

junit.test1.c.build:

native.build:

gluegen.properties.load.user:

gluegen.cpptasks.initialize:

gluegen.cpptasks.striplibs:
     [echo] Strip symbols from libs in ../build/test/build/natives

developer-zip-archive:

all:

jogamp.env.init:

gluegen.properties.load.user:

gluegen.cpptasks.initialize:

gluegen.cpptasks.detect.os.1:

gluegen.cpptasks.detect.os.freebsd.amd64:

gluegen.cpptasks.detect.os.freebsd.x86:

gluegen.cpptasks.detect.os.freebsd:

gluegen.cpptasks.detect.os.hpux:

gluegen.cpptasks.detect.os.linux.amd64:

gluegen.cpptasks.detect.os.linux.ia64:

gluegen.cpptasks.detect.os.linux.x86:

gluegen.cpptasks.detect.os.linux:

gluegen.cpptasks.detect.os.osx:

gluegen.cpptasks.detect.os.solaris.sparc:

gluegen.cpptasks.detect.os.solaris.sparcv9:

gluegen.cpptasks.detect.os.solaris.amd64:

gluegen.cpptasks.detect.os.solaris.x86:

gluegen.cpptasks.detect.os.solaris:

gluegen.cpptasks.detect.os.unix:

gluegen.cpptasks.detect.os.windows.amd64:

gluegen.cpptasks.detect.os.windows.x86:

gluegen.cpptasks.detect.os.windows:

gluegen.cpptasks.detect.os.2:

gluegen.cpptasks.detect.os:

setup-excludes-1:

setup-excludes-2:

init:

java.class.path.validate:

validate:

junit.compile:

jogamp.env.init:

gluegen.properties.load.user:

init:

java.class.path.validate:

validate:
     [echo] test.base.dir: ../src/junit 
     [echo] test.junit.generation.dir: ../src/junit/com/jogamp/gluegen/test/junit/generation 
     [echo] test.dir: ../build/test 
     [echo] results: ../build/test/results 
     [echo] build_t: ../build/test/build 
     [echo] build_t.gen: ../build/test/build/gensrc 
     [echo] build_t.java: ../build/test/build/classes 
     [echo] build_t.obj: ../build/test/build/obj 
     [echo] build_t.lib: ../build/test/build/natives 

junit.compile.check:

junit.compile:

junit.run:

jogamp.env.init:

gluegen.properties.load.user:

init:

java.class.path.validate:

validate:
     [echo] test.base.dir: ../src/junit 
     [echo] test.junit.generation.dir: ../src/junit/com/jogamp/gluegen/test/junit/generation 
     [echo] test.dir: ../build/test 
     [echo] results: ../build/test/results 
     [echo] build_t: ../build/test/build 
     [echo] build_t.gen: ../build/test/build/gensrc 
     [echo] build_t.java: ../build/test/build/classes 
     [echo] build_t.obj: ../build/test/build/obj 
     [echo] build_t.lib: ../build/test/build/natives 

gluegen.cpptasks.initialize:

gluegen.cpptasks.detect.os.1:

gluegen.cpptasks.detect.os.freebsd.amd64:

gluegen.cpptasks.detect.os.freebsd.x86:

gluegen.cpptasks.detect.os.freebsd:

gluegen.cpptasks.detect.os.hpux:

gluegen.cpptasks.detect.os.linux.amd64:

gluegen.cpptasks.detect.os.linux.ia64:

gluegen.cpptasks.detect.os.linux.x86:

gluegen.cpptasks.detect.os.linux:

gluegen.cpptasks.detect.os.osx:

gluegen.cpptasks.detect.os.solaris.sparc:

gluegen.cpptasks.detect.os.solaris.sparcv9:

gluegen.cpptasks.detect.os.solaris.amd64:

gluegen.cpptasks.detect.os.solaris.x86:

gluegen.cpptasks.detect.os.solaris:

gluegen.cpptasks.detect.os.unix:

gluegen.cpptasks.detect.os.windows.amd64:

gluegen.cpptasks.detect.os.windows.x86:

gluegen.cpptasks.detect.os.windows:

gluegen.cpptasks.detect.os.2:

gluegen.cpptasks.detect.os:

junit.run:
    [junit] Testsuite: com.jogamp.common.nio.BuffersTest
    [junit] Testsuite: com.jogamp.common.nio.BuffersTest
    [junit] Tests run: 1, Failures: 0, Errors: 0, Time elapsed: 0.079 sec
    [junit] 
    [junit] Testcase: slice took 0.007 sec
    [junit] Tests run: 1, Failures: 0, Errors: 0, Time elapsed: 0.079 sec
    [junit] 
    [junit] Testsuite: com.jogamp.common.nio.CachedBufferFactoryTest
    [junit] Testsuite: com.jogamp.common.nio.CachedBufferFactoryTest
    [junit] Tests run: 3, Failures: 0, Errors: 0, Time elapsed: 0.038 sec
    [junit] 
    [junit] Testcase: dynamicTest took 0.007 sec
    [junit] Testcase: dynamicConcurrentTest took 0.012 sec
    [junit] Testcase: staticTest took 0 sec
    [junit] Tests run: 3, Failures: 0, Errors: 0, Time elapsed: 0.038 sec
    [junit] 
    [junit] Testsuite: com.jogamp.common.nio.TestBuffersFloatDoubleConversion
    [junit] Testsuite: com.jogamp.common.nio.TestBuffersFloatDoubleConversion
    [junit] Tests run: 1, Failures: 0, Errors: 0, Time elapsed: 0.015 sec
    [junit] 
    [junit] Testcase: testDoubleArray2FloatArrayAndBack01 took 0 sec
    [junit] Tests run: 1, Failures: 0, Errors: 0, Time elapsed: 0.015 sec
    [junit] 
    [junit] Testsuite: com.jogamp.common.nio.TestPointerBufferEndian
    [junit] Testsuite: com.jogamp.common.nio.TestPointerBufferEndian
    [junit] OS: <Linux> CPU: <i386> Bits: <32/32>
    [junit] CPU is: 32 bit
    [junit] Buffer is in: little endian
    [junit] OS: <Linux> CPU: <i386> Bits: <32/32>
    [junit] CPU is: 32 bit
    [junit] Buffer is in: little endian
    [junit] Tests run: 2, Failures: 0, Errors: 0, Time elapsed: 0.025 sec
    [junit] ------------- Standard Output ---------------
    [junit] OS: <Linux> CPU: <i386> Bits: <32/32>
    [junit] CPU is: 32 bit
    [junit] Buffer is in: little endian
    [junit] OS: <Linux> CPU: <i386> Bits: <32/32>
    [junit] CPU is: 32 bit
    [junit] Buffer is in: little endian
    [junit] ------------- ---------------- ---------------
    [junit] 
    [junit] Testcase: testDirect took 0.008 sec
    [junit] Testcase: testIndirect took 0 sec
    [junit] Tests run: 2, Failures: 0, Errors: 0, Time elapsed: 0.025 sec
    [junit] 
    [junit] ------------- Standard Output ---------------
    [junit] OS: <Linux> CPU: <i386> Bits: <32/32>
    [junit] CPU is: 32 bit
    [junit] Buffer is in: little endian
    [junit] OS: <Linux> CPU: <i386> Bits: <32/32>
    [junit] CPU is: 32 bit
    [junit] Buffer is in: little endian
    [junit] ------------- ---------------- ---------------
    [junit] Testsuite: com.jogamp.common.nio.TestStructAccessorEndian
    [junit] Testsuite: com.jogamp.common.nio.TestStructAccessorEndian
    [junit] OS: <Linux> CPU: <i386> Bits: <32/32>
    [junit] CPU is: 32 bit
    [junit] Buffer is in: little endian
    [junit] Tests run: 1, Failures: 0, Errors: 0, Time elapsed: 0.017 sec
    [junit] ------------- Standard Output ---------------
    [junit] OS: <Linux> CPU: <i386> Bits: <32/32>
    [junit] CPU is: 32 bit
    [junit] Buffer is in: little endian
    [junit] ------------- ---------------- ---------------
    [junit] 
    [junit] Testcase: testStructAccessorEndian1 took 0.002 sec
    [junit] Tests run: 1, Failures: 0, Errors: 0, Time elapsed: 0.017 sec
    [junit] 
    [junit] ------------- Standard Output ---------------
    [junit] OS: <Linux> CPU: <i386> Bits: <32/32>
    [junit] CPU is: 32 bit
    [junit] Buffer is in: little endian
    [junit] ------------- ---------------- ---------------
    [junit] Testsuite: com.jogamp.common.util.IntIntHashMapTest
    [junit] Testsuite: com.jogamp.common.util.IntIntHashMapTest
    [junit] com.jogamp.common.util.IntIntHashMap vs java.util.HashMap warmup: true
    [junit] put
    [junit]    iimap: 3.226894ms
    [junit]    map:   13.905926ms
    [junit] 
    [junit] get
    [junit]    iimap: 3.651693ms
    [junit]    map:   6.347595ms
    [junit] 
    [junit] remove
    [junit]    iimap: 2.226568ms
    [junit]    map:   11.386703ms
    [junit] com.jogamp.common.util.IntIntHashMap vs java.util.HashMap warmup: false
    [junit] put
    [junit]    iimap: 1.916959ms
    [junit]    map:   2.568346ms
    [junit] 
    [junit] get
    [junit]    iimap: 0.505327ms
    [junit]    map:   1.439326ms
    [junit] 
    [junit] remove
    [junit]    iimap: 0.462062ms
    [junit]    map:   1.623386ms
    [junit] Tests run: 3, Failures: 0, Errors: 0, Time elapsed: 6.178 sec
    [junit] ------------- Standard Output ---------------
    [junit] com.jogamp.common.util.IntIntHashMap vs java.util.HashMap warmup: true
    [junit] put
    [junit]    iimap: 3.226894ms
    [junit]    map:   13.905926ms
    [junit] 
    [junit] get
    [junit]    iimap: 3.651693ms
    [junit]    map:   6.347595ms
    [junit] 
    [junit] remove
    [junit]    iimap: 2.226568ms
    [junit]    map:   11.386703ms
    [junit] com.jogamp.common.util.IntIntHashMap vs java.util.HashMap warmup: false
    [junit] put
    [junit]    iimap: 1.916959ms
    [junit]    map:   2.568346ms
    [junit] 
    [junit] get
    [junit]    iimap: 0.505327ms
    [junit]    map:   1.439326ms
    [junit] 
    [junit] remove
    [junit]    iimap: 0.462062ms
    [junit]    map:   1.623386ms
    [junit] ------------- ---------------- ---------------
    [junit] 
    [junit] Testcase: testPutRemove took 6.085 sec
    [junit] Testcase: iteratorTest took 0.011 sec
    [junit] Testcase: benchmark took 0.051 sec
    [junit] Tests run: 3, Failures: 0, Errors: 0, Time elapsed: 6.178 sec
    [junit] 
    [junit] ------------- Standard Output ---------------
    [junit] com.jogamp.common.util.IntIntHashMap vs java.util.HashMap warmup: true
    [junit] put
    [junit]    iimap: 3.226894ms
    [junit]    map:   13.905926ms
    [junit] 
    [junit] get
    [junit]    iimap: 3.651693ms
    [junit]    map:   6.347595ms
    [junit] 
    [junit] remove
    [junit]    iimap: 2.226568ms
    [junit]    map:   11.386703ms
    [junit] com.jogamp.common.util.IntIntHashMap vs java.util.HashMap warmup: false
    [junit] put
    [junit]    iimap: 1.916959ms
    [junit]    map:   2.568346ms
    [junit] 
    [junit] get
    [junit]    iimap: 0.505327ms
    [junit]    map:   1.439326ms
    [junit] 
    [junit] remove
    [junit]    iimap: 0.462062ms
    [junit]    map:   1.623386ms
    [junit] ------------- ---------------- ---------------
    [junit] Testsuite: com.jogamp.common.util.LongIntHashMapTest
    [junit] Testsuite: com.jogamp.common.util.LongIntHashMapTest
    [junit] com.jogamp.common.util.LongIntHashMap vs java.util.HashMap warmup: true
    [junit] put
    [junit]    iimap: 2.850678ms
    [junit]    map:   5.381715ms
    [junit] 
    [junit] get
    [junit]    iimap: 3.959993ms
    [junit]    map:   3.502599ms
    [junit] 
    [junit] remove
    [junit]    iimap: 1.979304ms
    [junit]    map:   12.804936ms
    [junit] com.jogamp.common.util.LongIntHashMap vs java.util.HashMap warmup: false
    [junit] put
    [junit]    iimap: 2.828953ms
    [junit]    map:   5.326031ms
    [junit] 
    [junit] get
    [junit]    iimap: 2.036472ms
    [junit]    map:   3.285938ms
    [junit] 
    [junit] remove
    [junit]    iimap: 2.025724ms
    [junit]    map:   3.359959ms
    [junit] Tests run: 3, Failures: 0, Errors: 0, Time elapsed: 6.061 sec
    [junit] ------------- Standard Output ---------------
    [junit] com.jogamp.common.util.LongIntHashMap vs java.util.HashMap warmup: true
    [junit] put
    [junit]    iimap: 2.850678ms
    [junit]    map:   5.381715ms
    [junit] 
    [junit] get
    [junit]    iimap: 3.959993ms
    [junit]    map:   3.502599ms
    [junit] 
    [junit] remove
    [junit]    iimap: 1.979304ms
    [junit]    map:   12.804936ms
    [junit] com.jogamp.common.util.LongIntHashMap vs java.util.HashMap warmup: false
    [junit] put
    [junit]    iimap: 2.828953ms
    [junit]    map:   5.326031ms
    [junit] 
    [junit] get
    [junit]    iimap: 2.036472ms
    [junit]    map:   3.285938ms
    [junit] 
    [junit] remove
    [junit]    iimap: 2.025724ms
    [junit]    map:   3.359959ms
    [junit] ------------- ---------------- ---------------
    [junit] 
    [junit] Testcase: testPutRemove took 5.98 sec
    [junit] Testcase: iteratorTest took 0.01 sec
    [junit] Testcase: benchmark took 0.051 sec
    [junit] Tests run: 3, Failures: 0, Errors: 0, Time elapsed: 6.061 sec
    [junit] 
    [junit] ------------- Standard Output ---------------
    [junit] com.jogamp.common.util.LongIntHashMap vs java.util.HashMap warmup: true
    [junit] put
    [junit]    iimap: 2.850678ms
    [junit]    map:   5.381715ms
    [junit] 
    [junit] get
    [junit]    iimap: 3.959993ms
    [junit]    map:   3.502599ms
    [junit] 
    [junit] remove
    [junit]    iimap: 1.979304ms
    [junit]    map:   12.804936ms
    [junit] com.jogamp.common.util.LongIntHashMap vs java.util.HashMap warmup: false
    [junit] put
    [junit]    iimap: 2.828953ms
    [junit]    map:   5.326031ms
    [junit] 
    [junit] get
    [junit]    iimap: 2.036472ms
    [junit]    map:   3.285938ms
    [junit] 
    [junit] remove
    [junit]    iimap: 2.025724ms
    [junit]    map:   3.359959ms
    [junit] ------------- ---------------- ---------------
    [junit] Testsuite: com.jogamp.common.util.TestArrayHashSet01
    [junit] Testsuite: com.jogamp.common.util.TestArrayHashSet01
    [junit] Tests run: 1, Failures: 0, Errors: 0, Time elapsed: 0.016 sec
    [junit] 
    [junit] Testcase: test01ArrayHashSet took 0.002 sec
    [junit] Tests run: 1, Failures: 0, Errors: 0, Time elapsed: 0.016 sec
    [junit] 
    [junit] Testsuite: com.jogamp.common.util.TestIteratorIndexCORE
    [junit] Testsuite: com.jogamp.common.util.TestIteratorIndexCORE
    [junit] test01-arraylist-iterator sum: 549999945
    [junit] test01-arraylist-index sum: 549999945
    [junit] test01-linkedlist-iterator sum: 549999945
    [junit] test01-linkedlist-index sum: 549999945
    [junit] Version Info:
    [junit] -----------------------------------------------------------------------------------------------------
    [junit] Package: com.jogamp.common
    [junit] Extension Name: com.jogamp.common
    [junit] Specification Title: GlueGen Java Bindings Generator
    [junit] Specification Vendor: JogAmp Community
    [junit] Specification Version: 2.0
    [junit] Implementation Title: GlueGen Compile-Time
    [junit] Implementation Vendor: JogAmp Community
    [junit] Implementation Vendor ID: com.jogamp
    [junit] Implementation URL: http://jogamp.org/
    [junit] Implementation Version: 2.0-b294-20110223
    [junit] Implementation Branch: master
    [junit] Implementation Commit: b88976ac189c8154be2a8e2b748711c85a1af421
    [junit] -----------------------------------------------------------------------------------------------------
    [junit] 
    [junit] Full Manifest:
    [junit]  Implementation-Title = GlueGen Compile-Time
    [junit]  Implementation-Version = 2.0-b294-20110223
    [junit]  Class-Path = antlr.jar
    [junit]  Manifest-Version = 1.0
    [junit]  Specification-Vendor = JogAmp Community
    [junit]  Created-By = 1.6.0_24-b07 (Sun Microsystems Inc.)
    [junit]  Implementation-URL = http://jogamp.org/
    [junit]  Ant-Version = Apache Ant 1.8.2
    [junit]  Implementation-Commit = b88976ac189c8154be2a8e2b748711c85a1af421
    [junit]  Implementation-Vendor = JogAmp Community
    [junit]  Implementation-Vendor-Id = com.jogamp
    [junit]  Specification-Title = GlueGen Java Bindings Generator
    [junit]  Implementation-Branch = master
    [junit]  Specification-Version = 2.0
    [junit]  Main-Class = com.jogamp.gluegen.GlueGen
    [junit]  Extension-Name = com.jogamp.common
    [junit] 
    [junit] ++++ TestRecursiveLock01.testLockedObjectThreading25x25-Yield
    [junit] Tests run: 4, Failures: 0, Errors: 0, Time elapsed: 2.406 sec
    [junit] ------------- Standard Error -----------------
    [junit] test01-arraylist-iterator sum: 549999945
    [junit] test01-arraylist-index sum: 549999945
    [junit] test01-linkedlist-iterator sum: 549999945
    [junit] test01-linkedlist-index sum: 549999945
    [junit] ------------- ---------------- ---------------
    [junit] 
    [junit] Testcase: test01ArrayListIterator took 0.549 sec
    [junit] Testcase: test0ArrayListIndex took 0.307 sec
    [junit] Testcase: test01LinkedListListIterator took 0.599 sec
    [junit] Testcase: test01LinkedListListIndex took 0.937 sec
    [junit] Tests run: 4, Failures: 0, Errors: 0, Time elapsed: 2.406 sec
    [junit] 
    [junit] ------------- Standard Error -----------------
    [junit] test01-arraylist-iterator sum: 549999945
    [junit] test01-arraylist-index sum: 549999945
    [junit] test01-linkedlist-iterator sum: 549999945
    [junit] test01-linkedlist-index sum: 549999945
    [junit] ------------- ---------------- ---------------
    [junit] Testsuite: com.jogamp.common.util.TestVersionInfo
    [junit] Testsuite: com.jogamp.common.util.TestVersionInfo
    [junit] Tests run: 1, Failures: 0, Errors: 0, Time elapsed: 0.014 sec
    [junit] ------------- Standard Error -----------------
    [junit] Version Info:
    [junit] -----------------------------------------------------------------------------------------------------
    [junit] Package: com.jogamp.common
    [junit] Extension Name: com.jogamp.common
    [junit] Specification Title: GlueGen Java Bindings Generator
    [junit] Specification Vendor: JogAmp Community
    [junit] Specification Version: 2.0
    [junit] Implementation Title: GlueGen Compile-Time
    [junit] Implementation Vendor: JogAmp Community
    [junit] Implementation Vendor ID: com.jogamp
    [junit] Implementation URL: http://jogamp.org/
    [junit] Implementation Version: 2.0-b294-20110223
    [junit] Implementation Branch: master
    [junit] Implementation Commit: b88976ac189c8154be2a8e2b748711c85a1af421
    [junit] -----------------------------------------------------------------------------------------------------
    [junit] 
    [junit] Full Manifest:
    [junit]  Implementation-Title = GlueGen Compile-Time
    [junit]  Implementation-Version = 2.0-b294-20110223
    [junit]  Class-Path = antlr.jar
    [junit]  Manifest-Version = 1.0
    [junit]  Specification-Vendor = JogAmp Community
    [junit]  Created-By = 1.6.0_24-b07 (Sun Microsystems Inc.)
    [junit]  Implementation-URL = http://jogamp.org/
    [junit]  Ant-Version = Apache Ant 1.8.2
    [junit]  Implementation-Commit = b88976ac189c8154be2a8e2b748711c85a1af421
    [junit]  Implementation-Vendor = JogAmp Community
    [junit]  Implementation-Vendor-Id = com.jogamp
    [junit]  Specification-Title = GlueGen Java Bindings Generator
    [junit]  Implementation-Branch = master
    [junit]  Specification-Version = 2.0
    [junit]  Main-Class = com.jogamp.gluegen.GlueGen
    [junit]  Extension-Name = com.jogamp.common
    [junit] 
    [junit] ------------- ---------------- ---------------
    [junit] 
    [junit] Testcase: testInfo01 took 0.004 sec
    [junit] Tests run: 1, Failures: 0, Errors: 0, Time elapsed: 0.014 sec
    [junit] 
    [junit] ------------- Standard Error -----------------
    [junit] Version Info:
    [junit] -----------------------------------------------------------------------------------------------------
    [junit] Package: com.jogamp.common
    [junit] Extension Name: com.jogamp.common
    [junit] Specification Title: GlueGen Java Bindings Generator
    [junit] Specification Vendor: JogAmp Community
    [junit] Specification Version: 2.0
    [junit] Implementation Title: GlueGen Compile-Time
    [junit] Implementation Vendor: JogAmp Community
    [junit] Implementation Vendor ID: com.jogamp
    [junit] Implementation URL: http://jogamp.org/
    [junit] Implementation Version: 2.0-b294-20110223
    [junit] Implementation Branch: master
    [junit] Implementation Commit: b88976ac189c8154be2a8e2b748711c85a1af421
    [junit] -----------------------------------------------------------------------------------------------------
    [junit] 
    [junit] Full Manifest:
    [junit]  Implementation-Title = GlueGen Compile-Time
    [junit]  Implementation-Version = 2.0-b294-20110223
    [junit]  Class-Path = antlr.jar
    [junit]  Manifest-Version = 1.0
    [junit]  Specification-Vendor = JogAmp Community
    [junit]  Created-By = 1.6.0_24-b07 (Sun Microsystems Inc.)
    [junit]  Implementation-URL = http://jogamp.org/
    [junit]  Ant-Version = Apache Ant 1.8.2
    [junit]  Implementation-Commit = b88976ac189c8154be2a8e2b748711c85a1af421
    [junit]  Implementation-Vendor = JogAmp Community
    [junit]  Implementation-Vendor-Id = com.jogamp
    [junit]  Specification-Title = GlueGen Java Bindings Generator
    [junit]  Implementation-Branch = master
    [junit]  Specification-Version = 2.0
    [junit]  Main-Class = com.jogamp.gluegen.GlueGen
    [junit]  Extension-Name = com.jogamp.common
    [junit] 
    [junit] ------------- ---------------- ---------------
    [junit] Testsuite: com.jogamp.common.util.locks.TestRecursiveLock01
    [junit] Testsuite: com.jogamp.common.util.locks.TestRecursiveLock01
    [junit] ---- TestRecursiveLock01.testLockedObjectThreading25x25-Yield
    [junit] ++++ TestRecursiveLock01.testLockedObjectThreading25x25-None
    [junit] ---- TestRecursiveLock01.testLockedObjectThreading25x25-None
    [junit] Feb 23, 2011 9:11:57 PM com.jogamp.gluegen.pcpp.PCPP handleWarning
    [junit] WARNING: #warning "Test warning with quotes - they must have quotes" at "pcpptest.h" line "128"
    [junit] Expected: 
    [junit] -------------------------------
    [junit] #1"pcpptest.h"#defineCL_SCHAR_MIN(-127-1)#define__YES__1#16"pcpptest.h"#26"pcpptest.h"#36"pcpptest.h"cl_charGOOD_A;intGOOD_B;intGOOD_C;#40"pcpptest.h"#54"pcpptest.h"intTEST_D_GOOD;#60"pcpptest.h"#70"pcpptest.h"#77"pcpptest.h"#105"pcpptest.h"#123"pcpptest.h"intGOOD_F_1;intGOOD_F_2;#126"pcpptest.h"intGOOD_G;#128"pcpptest.h"#130"pcpptest.h"#134"pcpptest.h"#136"pcpptest.h"
    [junit] -------------------------------
    [junit] 
    [junit] Result: 
    [junit] -------------------------------
    [junit] #1"pcpptest.h"#defineCL_SCHAR_MIN(-127-1)#define__YES__1#16"pcpptest.h"#26"pcpptest.h"#36"pcpptest.h"cl_charGOOD_A;intGOOD_B;intGOOD_C;#40"pcpptest.h"#54"pcpptest.h"intTEST_D_GOOD;#60"pcpptest.h"#70"pcpptest.h"#77"pcpptest.h"#105"pcpptest.h"#123"pcpptest.h"intGOOD_F_1;intGOOD_F_2;#126"pcpptest.h"intGOOD_G;#128"pcpptest.h"#130"pcpptest.h"#134"pcpptest.h"#136"pcpptest.h"
    [junit] -------------------------------
    [junit] 
    [junit] Tests run: 2, Failures: 0, Errors: 0, Time elapsed: 0.344 sec
    [junit] ------------- Standard Error -----------------
    [junit] ++++ TestRecursiveLock01.testLockedObjectThreading25x25-Yield
    [junit] ---- TestRecursiveLock01.testLockedObjectThreading25x25-Yield
    [junit] ++++ TestRecursiveLock01.testLockedObjectThreading25x25-None
    [junit] ---- TestRecursiveLock01.testLockedObjectThreading25x25-None
    [junit] ------------- ---------------- ---------------
    [junit] 
    [junit] Testcase: testLockedObjectThreading25x25Yield took 0.179 sec
    [junit] Testcase: testLockedObjectThreading25x25None took 0.155 sec
    [junit] Tests run: 2, Failures: 0, Errors: 0, Time elapsed: 0.344 sec
    [junit] 
    [junit] ------------- Standard Error -----------------
    [junit] ++++ TestRecursiveLock01.testLockedObjectThreading25x25-Yield
    [junit] ---- TestRecursiveLock01.testLockedObjectThreading25x25-Yield
    [junit] ++++ TestRecursiveLock01.testLockedObjectThreading25x25-None
    [junit] ---- TestRecursiveLock01.testLockedObjectThreading25x25-None
    [junit] ------------- ---------------- ---------------
    [junit] Testsuite: com.jogamp.gluegen.test.junit.generation.PCPPTest
    [junit] Testsuite: com.jogamp.gluegen.test.junit.generation.PCPPTest
    [junit]  - - - System info - - - 
    [junit] OS: Linux
    [junit] VM: Java HotSpot(TM) Server VM
    [junit] rootrel.build: build
    [junit] execution root: /home/jogamp/JogAmpSlavex32/workspace/gluegen/label/linux-x86_32-nvidia/build/test/build/gluegen-test.jar
    [junit] gluegen project root: /home/jogamp/JogAmpSlavex32/workspace/gluegen/label/linux-x86_32-nvidia
    [junit] testOutput: /home/jogamp/JogAmpSlavex32/workspace/gluegen/label/linux-x86_32-nvidia/build/test
    [junit]  - - - - - - - - - - - - 
    [junit] Tests run: 1, Failures: 0, Errors: 0, Time elapsed: 0.033 sec
    [junit] ------------- Standard Output ---------------
    [junit]  - - - System info - - - 
    [junit] OS: Linux
    [junit] VM: Java HotSpot(TM) Server VM
    [junit] rootrel.build: build
    [junit] execution root: /home/jogamp/JogAmpSlavex32/workspace/gluegen/label/linux-x86_32-nvidia/build/test/build/gluegen-test.jar
    [junit] gluegen project root: /home/jogamp/JogAmpSlavex32/workspace/gluegen/label/linux-x86_32-nvidia
    [junit] testOutput: /home/jogamp/JogAmpSlavex32/workspace/gluegen/label/linux-x86_32-nvidia/build/test
    [junit]  - - - - - - - - - - - - 
    [junit] ------------- ---------------- ---------------
    [junit] ------------- Standard Error -----------------
    [junit] Feb 23, 2011 9:11:57 PM com.jogamp.gluegen.pcpp.PCPP handleWarning
    [junit] WARNING: #warning "Test warning with quotes - they must have quotes" at "pcpptest.h" line "128"
    [junit] Expected: 
    [junit] -------------------------------
    [junit] #1"pcpptest.h"#defineCL_SCHAR_MIN(-127-1)#define__YES__1#16"pcpptest.h"#26"pcpptest.h"#36"pcpptest.h"cl_charGOOD_A;intGOOD_B;intGOOD_C;#40"pcpptest.h"#54"pcpptest.h"intTEST_D_GOOD;#60"pcpptest.h"#70"pcpptest.h"#77"pcpptest.h"#105"pcpptest.h"#123"pcpptest.h"intGOOD_F_1;intGOOD_F_2;#126"pcpptest.h"intGOOD_G;#128"pcpptest.h"#130"pcpptest.h"#134"pcpptest.h"#136"pcpptest.h"
    [junit] -------------------------------
    [junit] 
    [junit] Result: 
    [junit] -------------------------------
    [junit] #1"pcpptest.h"#defineCL_SCHAR_MIN(-127-1)#define__YES__1#16"pcpptest.h"#26"pcpptest.h"#36"pcpptest.h"cl_charGOOD_A;intGOOD_B;intGOOD_C;#40"pcpptest.h"#54"pcpptest.h"intTEST_D_GOOD;#60"pcpptest.h"#70"pcpptest.h"#77"pcpptest.h"#105"pcpptest.h"#123"pcpptest.h"intGOOD_F_1;intGOOD_F_2;#126"pcpptest.h"intGOOD_G;#128"pcpptest.h"#130"pcpptest.h"#134"pcpptest.h"#136"pcpptest.h"
    [junit] -------------------------------
    [junit] 
    [junit] ------------- ---------------- ---------------
    [junit] 
    [junit] Testcase: pcppMacroDefinitionTest took 0.025 sec
    [junit] Tests run: 1, Failures: 0, Errors: 0, Time elapsed: 0.033 sec
    [junit] 
    [junit] ------------- Standard Output ---------------
    [junit]  - - - System info - - - 
    [junit] OS: Linux
    [junit] VM: Java HotSpot(TM) Server VM
    [junit] rootrel.build: build
    [junit] execution root: /home/jogamp/JogAmpSlavex32/workspace/gluegen/label/linux-x86_32-nvidia/build/test/build/gluegen-test.jar
    [junit] gluegen project root: /home/jogamp/JogAmpSlavex32/workspace/gluegen/label/linux-x86_32-nvidia
    [junit] testOutput: /home/jogamp/JogAmpSlavex32/workspace/gluegen/label/linux-x86_32-nvidia/build/test
    [junit]  - - - - - - - - - - - - 
    [junit] ------------- ---------------- ---------------
    [junit] ------------- Standard Error -----------------
    [junit] Feb 23, 2011 9:11:57 PM com.jogamp.gluegen.pcpp.PCPP handleWarning
    [junit] WARNING: #warning "Test warning with quotes - they must have quotes" at "pcpptest.h" line "128"
    [junit] Expected: 
    [junit] -------------------------------
    [junit] #1"pcpptest.h"#defineCL_SCHAR_MIN(-127-1)#define__YES__1#16"pcpptest.h"#26"pcpptest.h"#36"pcpptest.h"cl_charGOOD_A;intGOOD_B;intGOOD_C;#40"pcpptest.h"#54"pcpptest.h"intTEST_D_GOOD;#60"pcpptest.h"#70"pcpptest.h"#77"pcpptest.h"#105"pcpptest.h"#123"pcpptest.h"intGOOD_F_1;intGOOD_F_2;#126"pcpptest.h"intGOOD_G;#128"pcpptest.h"#130"pcpptest.h"#134"pcpptest.h"#136"pcpptest.h"
    [junit] -------------------------------
    [junit] 
    [junit] Result: 
    [junit] -------------------------------
    [junit] #1"pcpptest.h"#defineCL_SCHAR_MIN(-127-1)#define__YES__1#16"pcpptest.h"#26"pcpptest.h"#36"pcpptest.h"cl_charGOOD_A;intGOOD_B;intGOOD_C;#40"pcpptest.h"#54"pcpptest.h"intTEST_D_GOOD;#60"pcpptest.h"#70"pcpptest.h"#77"pcpptest.h"#105"pcpptest.h"#123"pcpptest.h"intGOOD_F_1;intGOOD_F_2;#126"pcpptest.h"intGOOD_G;#128"pcpptest.h"#130"pcpptest.h"#134"pcpptest.h"#136"pcpptest.h"
    [junit] -------------------------------
    [junit] 
    [junit] ------------- ---------------- ---------------
    [junit] Testsuite: com.jogamp.gluegen.test.junit.generation.Test1p1JavaEmitter
    [junit] Testsuite: com.jogamp.gluegen.test.junit.generation.Test1p1JavaEmitter
    [junit] Tests run: 4, Failures: 0, Errors: 0, Time elapsed: 0.016 sec
    [junit] 
    [junit] Testcase: chapter01TestLoadLibrary took 0.002 sec
    [junit] Testcase: chapter02TestClassExist took 0.002 sec
    [junit] Testcase: chapter03TestCoverageFunctionalityDirectNIOAndPrimitiveArray took 0.004 sec
    [junit] Testcase: chapter04TestSomeFunctionsAllIndirect took 0 sec
    [junit] Tests run: 4, Failures: 0, Errors: 0, Time elapsed: 0.016 sec
    [junit] 
    [junit] Testsuite: com.jogamp.gluegen.test.junit.generation.Test1p2ProcAddressEmitter
    [junit] Testsuite: com.jogamp.gluegen.test.junit.generation.Test1p2ProcAddressEmitter
    [junit] Tests run: 4, Failures: 0, Errors: 0, Time elapsed: 0.018 sec
    [junit] 
    [junit] Testcase: chapter01TestLoadLibrary took 0.008 sec
    [junit] Testcase: chapter02TestClassExist took 0.001 sec
    [junit] Testcase: chapter03TestCoverageFunctionalityDirectNIOAndPrimitiveArray took 0.003 sec
    [junit] Testcase: chapter04TestSomeFunctionsAllIndirect took 0 sec
    [junit] Tests run: 4, Failures: 0, Errors: 0, Time elapsed: 0.018 sec
    [junit] 

jogamp.env.init:

gluegen.properties.load.user:

init:

java.class.path.validate:

validate:
     [echo] test.base.dir: ../src/junit 
     [echo] test.junit.generation.dir: ../src/junit/com/jogamp/gluegen/test/junit/generation 
     [echo] test.dir: ../build/test 
     [echo] results: ../build/test/results 
     [echo] build_t: ../build/test/build 
     [echo] build_t.gen: ../build/test/build/gensrc 
     [echo] build_t.java: ../build/test/build/classes 
     [echo] build_t.obj: ../build/test/build/obj 
     [echo] build_t.lib: ../build/test/build/natives 

test-zip-archive:
     [exec] 
     [exec] 7-Zip 9.04 beta  Copyright (c) 1999-2009 Igor Pavlov  2009-05-30
     [exec] p7zip Version 9.04 (locale=en_US.UTF-8,Utf16=on,HugeFiles=on,4 CPUs)
     [exec] Scanning
     [exec] 
     [exec] Creating archive /home/jogamp/JogAmpSlavex32/workspace/gluegen/label/linux-x86_32-nvidia/build/gluegen-2.0-b294-20110223-linux-i586-test-results-linux64-NVFX580-ubuntu10-jogamp-x32-c3d-003.7z
     [exec] 
     [exec] Compressing  TEST-com.jogamp.common.nio.BuffersTest.xml
     [exec] Compressing  TEST-com.jogamp.common.nio.CachedBufferFactoryTest.xml
     [exec] Compressing  TEST-com.jogamp.common.nio.TestBuffersFloatDoubleConversion.xml
     [exec] Compressing  TEST-com.jogamp.common.nio.TestPointerBufferEndian.xml
     [exec] Compressing  TEST-com.jogamp.common.nio.TestStructAccessorEndian.xml
     [exec] Compressing  TEST-com.jogamp.common.util.IntIntHashMapTest.xml
     [exec] Compressing  TEST-com.jogamp.common.util.locks.TestRecursiveLock01.xml
     [exec] Compressing  TEST-com.jogamp.common.util.LongIntHashMapTest.xml
     [exec] Compressing  TEST-com.jogamp.common.util.TestArrayHashSet01.xml
     [exec] Compressing  TEST-com.jogamp.common.util.TestIteratorIndexCORE.xml
     [exec] Compressing  TEST-com.jogamp.common.util.TestVersionInfo.xml
     [exec] Compressing  TEST-com.jogamp.gluegen.test.junit.generation.PCPPTest.xml
     [exec] Compressing  TEST-com.jogamp.gluegen.test.junit.generation.Test1p1JavaEmitter.xml
     [exec] Compressing  TEST-com.jogamp.gluegen.test.junit.generation.Test1p2ProcAddressEmitter.xml
     [exec] 
     [exec] Everything is Ok

BUILD SUCCESSFUL
Total time: 48 seconds
[WARNINGS] Parsing warnings in console log...
[WARNINGS] GNU compiler (gcc) : Found 7 warnings.
[WARNINGS] Java Compiler : Found 0 warnings.
[WARNINGS] Java Compiler : Found 0 warnings.
[WARNINGS] JavaDoc : Found 0 warnings.
Archiving artifacts
Recording test results
ERROR: Failed to archive test reports
hudson.util.IOException2: remote file operation failed: /home/jogamp/JogAmpSlavex32/workspace/gluegen/label/linux-x86_32-nvidia at hudson.remoting.Channel@6342c411:linux64-NVFX580-ubuntu10-jogamp-x32-c3d-003
	at hudson.FilePath.act(FilePath.java:752)
	at hudson.FilePath.act(FilePath.java:738)
	at hudson.tasks.junit.JUnitParser.parse(JUnitParser.java:83)
	at hudson.tasks.junit.JUnitResultArchiver.parse(JUnitResultArchiver.java:123)
	at hudson.tasks.junit.JUnitResultArchiver.perform(JUnitResultArchiver.java:135)
	at hudson.tasks.BuildStepMonitor$1.perform(BuildStepMonitor.java:19)
	at hudson.model.AbstractBuild$AbstractRunner.perform(AbstractBuild.java:624)
	at hudson.model.AbstractBuild$AbstractRunner.performAllBuildSteps(AbstractBuild.java:603)
	at hudson.model.AbstractBuild$AbstractRunner.performAllBuildSteps(AbstractBuild.java:581)
	at hudson.model.Build$RunnerImpl.post2(Build.java:160)
	at hudson.model.AbstractBuild$AbstractRunner.post(AbstractBuild.java:550)
	at hudson.model.Run.run(Run.java:1386)
	at hudson.matrix.MatrixRun.run(MatrixRun.java:137)
	at hudson.model.ResourceController.execute(ResourceController.java:88)
	at hudson.model.Executor.run(Executor.java:145)
Caused by: hudson.util.IOException2: Failed to read /home/jogamp/JogAmpSlavex32/workspace/gluegen/label/linux-x86_32-nvidia/build/test/results/TEST-com.jogamp.common.nio.BuffersTest.xml
	at hudson.tasks.junit.TestResult.parse(TestResult.java:214)
	at hudson.tasks.junit.TestResult.parse(TestResult.java:155)
	at hudson.tasks.junit.TestResult.<init>(TestResult.java:118)
	at hudson.tasks.junit.JUnitParser$ParseResultCallable.invoke(JUnitParser.java:114)
	at hudson.tasks.junit.JUnitParser$ParseResultCallable.invoke(JUnitParser.java:87)
	at hudson.FilePath$FileCallableWrapper.call(FilePath.java:1931)
	at hudson.remoting.UserRequest.perform(UserRequest.java:114)
	at hudson.remoting.UserRequest.perform(UserRequest.java:48)
	at hudson.remoting.Request$2.run(Request.java:270)
	at java.util.concurrent.Executors$RunnableAdapter.call(Executors.java:441)
	at java.util.concurrent.FutureTask$Sync.innerRun(FutureTask.java:303)
	at java.util.concurrent.FutureTask.run(FutureTask.java:138)
	at java.util.concurrent.ThreadPoolExecutor$Worker.runTask(ThreadPoolExecutor.java:886)
	at java.util.concurrent.ThreadPoolExecutor$Worker.run(ThreadPoolExecutor.java:908)
	at hudson.remoting.Engine$1$1.run(Engine.java:59)
	at java.lang.Thread.run(Thread.java:662)
Caused by: org.dom4j.DocumentException: Error on line 228 of document file:///home/jogamp/JogAmpSlavex32/workspace/gluegen/label/linux-x86_32-nvidia/build/test/results/TEST-com.jogamp.common.nio.BuffersTest.xml : Content is not allowed in trailing section. Nested exception: Content is not allowed in trailing section.
	at org.dom4j.io.SAXReader.read(SAXReader.java:482)
	at org.dom4j.io.SAXReader.read(SAXReader.java:264)
	at hudson.tasks.junit.SuiteResult.parse(SuiteResult.java:99)
	at hudson.tasks.junit.TestResult.parse(TestResult.java:199)
	... 15 more
Caused by: org.xml.sax.SAXParseException: Content is not allowed in trailing section.
	at com.sun.org.apache.xerces.internal.util.ErrorHandlerWrapper.createSAXParseException(ErrorHandlerWrapper.java:195)
	at com.sun.org.apache.xerces.internal.util.ErrorHandlerWrapper.fatalError(ErrorHandlerWrapper.java:174)
	at com.sun.org.apache.xerces.internal.impl.XMLErrorReporter.reportError(XMLErrorReporter.java:388)
	at com.sun.org.apache.xerces.internal.impl.XMLScanner.reportFatalError(XMLScanner.java:1414)
	at com.sun.org.apache.xerces.internal.impl.XMLDocumentScannerImpl$TrailingMiscDriver.next(XMLDocumentScannerImpl.java:1459)
	at com.sun.org.apache.xerces.internal.impl.XMLDocumentScannerImpl.next(XMLDocumentScannerImpl.java:648)
	at com.sun.org.apache.xerces.internal.impl.XMLNSDocumentScannerImpl.next(XMLNSDocumentScannerImpl.java:140)
	at com.sun.org.apache.xerces.internal.impl.XMLDocumentFragmentScannerImpl.scanDocument(XMLDocumentFragmentScannerImpl.java:511)
	at com.sun.org.apache.xerces.internal.parsers.XML11Configuration.parse(XML11Configuration.java:808)
	at com.sun.org.apache.xerces.internal.parsers.XML11Configuration.parse(XML11Configuration.java:737)
	at com.sun.org.apache.xerces.internal.parsers.XMLParser.parse(XMLParser.java:119)
	at com.sun.org.apache.xerces.internal.parsers.AbstractSAXParser.parse(AbstractSAXParser.java:1205)
	at com.sun.org.apache.xerces.internal.jaxp.SAXParserImpl$JAXPSAXParser.parse(SAXParserImpl.java:522)
	at org.dom4j.io.SAXReader.read(SAXReader.java:465)
	... 18 more
Failed to send e-mail to Sven Gothel because no e-mail address is known, and no default e-mail domain is configured
Sending e-mails to: mediastream@jogamp.org
Email was triggered for: Failure
Sending email for trigger: Failure
Failed to send e-mail to Sven Gothel because no e-mail address is known, and no default e-mail domain is configured
Sending email to: mediastream@jogamp.org
Notifying upstream projects of job completion
Finished: FAILURE