UnstableConsole Output

Skipping 1,194 KB.. Full Log
d Method getConstructor, sig (Ljava/lang/String;[Ljava/lang/Class<*>;ZLjava/lang/ClassLoader;)Ljava/lang/reflect/Constructor<*>;, desc (Ljava/lang/String;[Ljava/lang/Class;ZLjava/lang/ClassLoader;)Ljava/lang/reflect/Constructor;, access final public static
    [junit] Class com.jogamp.common.util.RunnableTask
    [junit]  Added Method invokeOnNewThread, desc (Ljava/lang/ThreadGroup;ZLjava/lang/Runnable;Ljava/lang/String;)Ljava/lang/Thread;, access public static
    [junit] ++++ TestCase.tearDown: com.jogamp.common.util.TestVersionSemantics - testVersionLatest
    [junit] ------------- ---------------- ---------------
    [junit] 
    [junit] Testcase: testVersionLatest took 0.322 sec
    [junit] Tests run: 1, Failures: 0, Errors: 0, Time elapsed: 0.409 sec
    [junit] 
    [junit] ------------- Standard Error -----------------
    [junit] ++++ TestCase.setUp: com.jogamp.common.util.TestVersionSemantics - testVersionLatest
    [junit] Semantic Version Test
    [junit] Previous version: 2.1.5 (2.1.5) - lib/v2.1.5/gluegen-rt.jar
    [junit] Current  version: 2.2.0 (2.2.0-rc-20140703) - /Users/jogamp/JogAmpSlavex64_jre7/workspace/gluegen/label/macosx-10_7-x86_64-nvidia_jre7/build/gluegen-rt.jar
    [junit] Compat. expected: NON_BACKWARD_COMPATIBLE
    [junit] Compat. detected: NON_BACKWARD_COMPATIBLE
    [junit] Compat. result:   detected == expected -> OK
    [junit] Current version 2.2.0 (2.2.0-rc-20140703) is NON_BACKWARD_COMPATIBLE to previous version 2.1.5 (2.1.5), actually NON_BACKWARD_COMPATIBLE
    [junit] 
    [junit] 
    [junit] Summary: 6 differences in 3 classes:
    [junit]   Remove 2, Change 0, Deprecate 0, Add 4
    [junit] 
    [junit]    0/   3: com.jogamp.common.nio.Buffers        : Remove    1, Change    0, Deprecate    0, Add    2
    [junit]    1/   3: com.jogamp.common.util.ReflectionUtil: Remove    1, Change    0, Deprecate    0, Add    1
    [junit]    2/   3: com.jogamp.common.util.RunnableTask  : Remove    0, Change    0, Deprecate    0, Add    1
    [junit] 
    [junit] 
    [junit] Removes
    [junit] 
    [junit] Class com.jogamp.common.nio.Buffers
    [junit]  Removed Method slice2Float, desc (Ljava/nio/Buffer;[FII)Ljava/nio/FloatBuffer;, access final public static
    [junit] Class com.jogamp.common.util.ReflectionUtil
    [junit]  Removed Method getConstructor, sig (Ljava/lang/String;[Ljava/lang/Class<*>;Ljava/lang/ClassLoader;)Ljava/lang/reflect/Constructor<*>;, desc (Ljava/lang/String;[Ljava/lang/Class;Ljava/lang/ClassLoader;)Ljava/lang/reflect/Constructor;, access final public static
    [junit] 
    [junit] 
    [junit] Changes
    [junit] 
    [junit] 
    [junit] 
    [junit] Deprecates
    [junit] 
    [junit] 
    [junit] 
    [junit] Additions
    [junit] 
    [junit] Class com.jogamp.common.nio.Buffers
    [junit]  Added Method slice2Float, desc (Ljava/nio/Buffer;II)Ljava/nio/FloatBuffer;, access final public static
    [junit]  Added Method slice2Float, desc ([FII)Ljava/nio/FloatBuffer;, access final public static
    [junit] Class com.jogamp.common.util.ReflectionUtil
    [junit]  Added Method getConstructor, sig (Ljava/lang/String;[Ljava/lang/Class<*>;ZLjava/lang/ClassLoader;)Ljava/lang/reflect/Constructor<*>;, desc (Ljava/lang/String;[Ljava/lang/Class;ZLjava/lang/ClassLoader;)Ljava/lang/reflect/Constructor;, access final public static
    [junit] Class com.jogamp.common.util.RunnableTask
    [junit]  Added Method invokeOnNewThread, desc (Ljava/lang/ThreadGroup;ZLjava/lang/Runnable;Ljava/lang/String;)Ljava/lang/Thread;, access public static
    [junit] 
    [junit] 
    [junit] 
    [junit] 
    [junit] Class Order
    [junit] 
    [junit] Class com.jogamp.common.nio.Buffers
    [junit]  Added Method slice2Float, desc (Ljava/nio/Buffer;II)Ljava/nio/FloatBuffer;, access final public static
    [junit]  Removed Method slice2Float, desc (Ljava/nio/Buffer;[FII)Ljava/nio/FloatBuffer;, access final public static
    [junit]  Added Method slice2Float, desc ([FII)Ljava/nio/FloatBuffer;, access final public static
    [junit] Class com.jogamp.common.util.ReflectionUtil
    [junit]  Removed Method getConstructor, sig (Ljava/lang/String;[Ljava/lang/Class<*>;Ljava/lang/ClassLoader;)Ljava/lang/reflect/Constructor<*>;, desc (Ljava/lang/String;[Ljava/lang/Class;Ljava/lang/ClassLoader;)Ljava/lang/reflect/Constructor;, access final public static
    [junit]  Added Method getConstructor, sig (Ljava/lang/String;[Ljava/lang/Class<*>;ZLjava/lang/ClassLoader;)Ljava/lang/reflect/Constructor<*>;, desc (Ljava/lang/String;[Ljava/lang/Class;ZLjava/lang/ClassLoader;)Ljava/lang/reflect/Constructor;, access final public static
    [junit] Class com.jogamp.common.util.RunnableTask
    [junit]  Added Method invokeOnNewThread, desc (Ljava/lang/ThreadGroup;ZLjava/lang/Runnable;Ljava/lang/String;)Ljava/lang/Thread;, access public static
    [junit] ++++ TestCase.tearDown: com.jogamp.common.util.TestVersionSemantics - testVersionLatest
    [junit] ------------- ---------------- ---------------
    [junit] ++++ TestCase.setUp: com.jogamp.common.util.locks.TestRecursiveLock01 - testLockedObjectThreading25x100x100N_Int01_Fair
    [junit] Testsuite: com.jogamp.common.util.locks.TestRecursiveLock01
    [junit] Testsuite: com.jogamp.common.util.locks.TestRecursiveLock01
    [junit] 
    [junit] ---- TestRecursiveLock01.testLockedObjectThreading: i Int01, fair  , threads 25, loops-outter    100, loops-inner    100, yield  NONE - dt    807 ms, avrg  2018876 ns, deviation [ -2014376 ..  1004784 ] ns
    [junit] ++++ TestCase.tearDown: com.jogamp.common.util.locks.TestRecursiveLock01 - testLockedObjectThreading25x100x100N_Int01_Fair
    [junit] ++++ TestCase.setUp: com.jogamp.common.util.locks.TestRecursiveLock01 - testLockedObjectThreading25x100x100N_Int01_Unfair
    [junit] 
    [junit] ---- TestRecursiveLock01.testLockedObjectThreading: i Int01, unfair, threads 25, loops-outter    100, loops-inner    100, yield  NONE - dt    389 ms, avrg    18789 ns, deviation [   -15359 ..   259321 ] ns
    [junit] ++++ TestCase.tearDown: com.jogamp.common.util.locks.TestRecursiveLock01 - testLockedObjectThreading25x100x100N_Int01_Unfair
    [junit] ++++ TestCase.setUp: com.jogamp.common.util.locks.TestRecursiveLock01 - testLockedObjectThreading25x100x100N_Java5_Fair
    [junit] 
    [junit] ---- TestRecursiveLock01.testLockedObjectThreading: i Java5, fair  , threads 25, loops-outter    100, loops-inner    100, yield  NONE - dt    523 ms, avrg  2129275 ns, deviation [ -2125165 ..   819445 ] ns
    [junit] ++++ TestCase.tearDown: com.jogamp.common.util.locks.TestRecursiveLock01 - testLockedObjectThreading25x100x100N_Java5_Fair
    [junit] ++++ TestCase.setUp: com.jogamp.common.util.locks.TestRecursiveLock01 - testLockedObjectThreading25x100x100N_Java5_Unfair
    [junit] 
    [junit] ---- TestRecursiveLock01.testLockedObjectThreading: i Java5, unfair, threads 25, loops-outter    100, loops-inner    100, yield  NONE - dt    360 ms, avrg   119559 ns, deviation [  -116089 ..  1478131 ] ns
    [junit] ++++ TestCase.tearDown: com.jogamp.common.util.locks.TestRecursiveLock01 - testLockedObjectThreading25x100x100N_Java5_Unfair
    [junit] ++++ TestCase.setUp: com.jogamp.common.util.locks.TestRecursiveLock01 - testLockedObjectThreading25x100x100Y_Int01_Fair
    [junit] 
    [junit] ---- TestRecursiveLock01.testLockedObjectThreading: i Int01, fair  , threads 25, loops-outter    100, loops-inner    100, yield YIELD - dt   3205 ms, avrg 30009958 ns, deviation [  -686008 ..   773882 ] ns
    [junit] ++++ TestCase.tearDown: com.jogamp.common.util.locks.TestRecursiveLock01 - testLockedObjectThreading25x100x100Y_Int01_Fair
    [junit] ++++ TestCase.setUp: com.jogamp.common.util.locks.TestRecursiveLock01 - testLockedObjectThreading25x100x100Y_Int01_Unair
    [junit] 
    [junit] ---- TestRecursiveLock01.testLockedObjectThreading: i Int01, unfair, threads 25, loops-outter    100, loops-inner    100, yield YIELD - dt    789 ms, avrg  6749706 ns, deviation [  -158726 ..    61134 ] ns
    [junit] ++++ TestCase.tearDown: com.jogamp.common.util.locks.TestRecursiveLock01 - testLockedObjectThreading25x100x100Y_Int01_Unair
    [junit] ++++ TestCase.setUp: com.jogamp.common.util.locks.TestRecursiveLock01 - testLockedObjectThreading25x100x100Y_Java5_Fair
    [junit] 
    [junit] ---- TestRecursiveLock01.testLockedObjectThreading: i Java5, fair  , threads 25, loops-outter    100, loops-inner    100, yield YIELD - dt    522 ms, avrg  4089881 ns, deviation [   -48671 ..    40579 ] ns
    [junit] ++++ TestCase.tearDown: com.jogamp.common.util.locks.TestRecursiveLock01 - testLockedObjectThreading25x100x100Y_Java5_Fair
    [junit] ++++ TestCase.setUp: com.jogamp.common.util.locks.TestRecursiveLock01 - testLockedObjectThreading25x100x100Y_Java5_Unfair
    [junit] 
    [junit] ---- TestRecursiveLock01.testLockedObjectThreading: i Java5, unfair, threads 25, loops-outter    100, loops-inner    100, yield YIELD - dt    504 ms, avrg 10290489 ns, deviation [ -7316929 .. 11875831 ] ns
    [junit] ++++ TestCase.tearDown: com.jogamp.common.util.locks.TestRecursiveLock01 - testLockedObjectThreading25x100x100Y_Java5_Unfair
    [junit] ++++ TestCase.setUp: com.jogamp.common.util.locks.TestRecursiveLock01 - testLockedObjectThreading5x1000x10000N_Int01_Fair
    [junit] 
    [junit] ---- TestRecursiveLock01.testLockedObjectThreading: i Int01, fair  , threads  5, loops-outter   1000, loops-inner  10000, yield  NONE - dt    610 ms, avrg   147926 ns, deviation [   -20613 ..    18149 ] ns
    [junit] ++++ TestCase.tearDown: com.jogamp.common.util.locks.TestRecursiveLock01 - testLockedObjectThreading5x1000x10000N_Int01_Fair
    [junit] ++++ TestCase.setUp: com.jogamp.common.util.locks.TestRecursiveLock01 - testLockedObjectThreading5x1000x10000N_Int01_Unfair
    [junit] 
    [junit] ---- TestRecursiveLock01.testLockedObjectThreading: i Int01, unfair, threads  5, loops-outter   1000, loops-inner  10000, yield  NONE - dt    683 ms, avrg     7939 ns, deviation [    -5513 ..     8552 ] ns
    [junit] ++++ TestCase.tearDown: com.jogamp.common.util.locks.TestRecursiveLock01 - testLockedObjectThreading5x1000x10000N_Int01_Unfair
    [junit] ++++ TestCase.setUp: com.jogamp.common.util.locks.TestRecursiveLock01 - testLockedObjectThreading5x1000x10000N_Java5_Fair
    [junit] 
    [junit] ---- TestRecursiveLock01.testLockedObjectThreading: i Java5, fair  , threads  5, loops-outter   1000, loops-inner  10000, yield  NONE - dt    724 ms, avrg   537848 ns, deviation [   -15367 ..    12908 ] ns
    [junit] ++++ TestCase.tearDown: com.jogamp.common.util.locks.TestRecursiveLock01 - testLockedObjectThreading5x1000x10000N_Java5_Fair
    [junit] ++++ TestCase.setUp: com.jogamp.common.util.locks.TestRecursiveLock01 - testLockedObjectThreading5x1000x10000N_Java5_Unfair
    [junit] 
    [junit] ---- TestRecursiveLock01.testLockedObjectThreading: i Java5, unfair, threads  5, loops-outter   1000, loops-inner  10000, yield  NONE - dt    907 ms, avrg     4205 ns, deviation [    -3856 ..    13252 ] ns
    [junit] ++++ TestCase.tearDown: com.jogamp.common.util.locks.TestRecursiveLock01 - testLockedObjectThreading5x1000x10000N_Java5_Unfair
    [junit] Tests run: 12, Failures: 0, Errors: 0, Time elapsed: 10.107 sec
    [junit] ------------- Standard Error -----------------
    [junit] ++++ TestCase.setUp: com.jogamp.common.util.locks.TestRecursiveLock01 - testLockedObjectThreading25x100x100N_Int01_Fair
    [junit] 
    [junit] ---- TestRecursiveLock01.testLockedObjectThreading: i Int01, fair  , threads 25, loops-outter    100, loops-inner    100, yield  NONE - dt    807 ms, avrg  2018876 ns, deviation [ -2014376 ..  1004784 ] ns
    [junit] ++++ TestCase.tearDown: com.jogamp.common.util.locks.TestRecursiveLock01 - testLockedObjectThreading25x100x100N_Int01_Fair
    [junit] ++++ TestCase.setUp: com.jogamp.common.util.locks.TestRecursiveLock01 - testLockedObjectThreading25x100x100N_Int01_Unfair
    [junit] 
    [junit] ---- TestRecursiveLock01.testLockedObjectThreading: i Int01, unfair, threads 25, loops-outter    100, loops-inner    100, yield  NONE - dt    389 ms, avrg    18789 ns, deviation [   -15359 ..   259321 ] ns
    [junit] ++++ TestCase.tearDown: com.jogamp.common.util.locks.TestRecursiveLock01 - testLockedObjectThreading25x100x100N_Int01_Unfair
    [junit] ++++ TestCase.setUp: com.jogamp.common.util.locks.TestRecursiveLock01 - testLockedObjectThreading25x100x100N_Java5_Fair
    [junit] 
    [junit] ---- TestRecursiveLock01.testLockedObjectThreading: i Java5, fair  , threads 25, loops-outter    100, loops-inner    100, yield  NONE - dt    523 ms, avrg  2129275 ns, deviation [ -2125165 ..   819445 ] ns
    [junit] ++++ TestCase.tearDown: com.jogamp.common.util.locks.TestRecursiveLock01 - testLockedObjectThreading25x100x100N_Java5_Fair
    [junit] ++++ TestCase.setUp: com.jogamp.common.util.locks.TestRecursiveLock01 - testLockedObjectThreading25x100x100N_Java5_Unfair
    [junit] 
    [junit] ---- TestRecursiveLock01.testLockedObjectThreading: i Java5, unfair, threads 25, loops-outter    100, loops-inner    100, yield  NONE - dt    360 ms, avrg   119559 ns, deviation [  -116089 ..  1478131 ] ns
    [junit] ++++ TestCase.tearDown: com.jogamp.common.util.locks.TestRecursiveLock01 - testLockedObjectThreading25x100x100N_Java5_Unfair
    [junit] ++++ TestCase.setUp: com.jogamp.common.util.locks.TestRecursiveLock01 - testLockedObjectThreading25x100x100Y_Int01_Fair
    [junit] 
    [junit] ---- TestRecursiveLock01.testLockedObjectThreading: i Int01, fair  , threads 25, loops-outter    100, loops-inner    100, yield YIELD - dt   3205 ms, avrg 30009958 ns, deviation [  -686008 ..   773882 ] ns
    [junit] ++++ TestCase.tearDown: com.jogamp.common.util.locks.TestRecursiveLock01 - testLockedObjectThreading25x100x100Y_Int01_Fair
    [junit] ++++ TestCase.setUp: com.jogamp.common.util.locks.TestRecursiveLock01 - testLockedObjectThreading25x100x100Y_Int01_Unair
    [junit] 
    [junit] ---- TestRecursiveLock01.testLockedObjectThreading: i Int01, unfair, threads 25, loops-outter    100, loops-inner    100, yield YIELD - dt    789 ms, avrg  6749706 ns, deviation [  -158726 ..    61134 ] ns
    [junit] ++++ TestCase.tearDown: com.jogamp.common.util.locks.TestRecursiveLock01 - testLockedObjectThreading25x100x100Y_Int01_Unair
    [junit] ++++ TestCase.setUp: com.jogamp.common.util.locks.TestRecursiveLock01 - testLockedObjectThreading25x100x100Y_Java5_Fair
    [junit] 
    [junit] ---- TestRecursiveLock01.testLockedObjectThreading: i Java5, fair  , threads 25, loops-outter    100, loops-inner    100, yield YIELD - dt    522 ms, avrg  4089881 ns, deviation [   -48671 ..    40579 ] ns
    [junit] ++++ TestCase.tearDown: com.jogamp.common.util.locks.TestRecursiveLock01 - testLockedObjectThreading25x100x100Y_Java5_Fair
    [junit] ++++ TestCase.setUp: com.jogamp.common.util.locks.TestRecursiveLock01 - testLockedObjectThreading25x100x100Y_Java5_Unfair
    [junit] 
    [junit] ---- TestRecursiveLock01.testLockedObjectThreading: i Java5, unfair, threads 25, loops-outter    100, loops-inner    100, yield YIELD - dt    504 ms, avrg 10290489 ns, deviation [ -7316929 .. 11875831 ] ns
    [junit] ++++ TestCase.tearDown: com.jogamp.common.util.locks.TestRecursiveLock01 - testLockedObjectThreading25x100x100Y_Java5_Unfair
    [junit] ++++ TestCase.setUp: com.jogamp.common.util.locks.TestRecursiveLock01 - testLockedObjectThreading5x1000x10000N_Int01_Fair
    [junit] 
    [junit] ---- TestRecursiveLock01.testLockedObjectThreading: i Int01, fair  , threads  5, loops-outter   1000, loops-inner  10000, yield  NONE - dt    610 ms, avrg   147926 ns, deviation [   -20613 ..    18149 ] ns
    [junit] ++++ TestCase.tearDown: com.jogamp.common.util.locks.TestRecursiveLock01 - testLockedObjectThreading5x1000x10000N_Int01_Fair
    [junit] ++++ TestCase.setUp: com.jogamp.common.util.locks.TestRecursiveLock01 - testLockedObjectThreading5x1000x10000N_Int01_Unfair
    [junit] 
    [junit] ---- TestRecursiveLock01.testLockedObjectThreading: i Int01, unfair, threads  5, loops-outter   1000, loops-inner  10000, yield  NONE - dt    683 ms, avrg     7939 ns, deviation [    -5513 ..     8552 ] ns
    [junit] ++++ TestCase.tearDown: com.jogamp.common.util.locks.TestRecursiveLock01 - testLockedObjectThreading5x1000x10000N_Int01_Unfair
    [junit] ++++ TestCase.setUp: com.jogamp.common.util.locks.TestRecursiveLock01 - testLockedObjectThreading5x1000x10000N_Java5_Fair
    [junit] 
    [junit] ---- TestRecursiveLock01.testLockedObjectThreading: i Java5, fair  , threads  5, loops-outter   1000, loops-inner  10000, yield  NONE - dt    724 ms, avrg   537848 ns, deviation [   -15367 ..    12908 ] ns
    [junit] ++++ TestCase.tearDown: com.jogamp.common.util.locks.TestRecursiveLock01 - testLockedObjectThreading5x1000x10000N_Java5_Fair
    [junit] ++++ TestCase.setUp: com.jogamp.common.util.locks.TestRecursiveLock01 - testLockedObjectThreading5x1000x10000N_Java5_Unfair
    [junit] 
    [junit] ---- TestRecursiveLock01.testLockedObjectThreading: i Java5, unfair, threads  5, loops-outter   1000, loops-inner  10000, yield  NONE - dt    907 ms, avrg     4205 ns, deviation [    -3856 ..    13252 ] ns
    [junit] ++++ TestCase.tearDown: com.jogamp.common.util.locks.TestRecursiveLock01 - testLockedObjectThreading5x1000x10000N_Java5_Unfair
    [junit] ------------- ---------------- ---------------
    [junit] 
    [junit] Testcase: testLockedObjectThreading25x100x100N_Int01_Fair took 0.809 sec
    [junit] Testcase: testLockedObjectThreading25x100x100N_Int01_Unfair took 0.389 sec
    [junit] Testcase: testLockedObjectThreading25x100x100N_Java5_Fair took 0.524 sec
    [junit] Testcase: testLockedObjectThreading25x100x100N_Java5_Unfair took 0.36 sec
    [junit] Testcase: testLockedObjectThreading25x100x100Y_Int01_Fair took 3.206 sec
    [junit] Testcase: testLockedObjectThreading25x100x100Y_Int01_Unair took 0.79 sec
    [junit] Testcase: testLockedObjectThreading25x100x100Y_Java5_Fair took 0.523 sec
    [junit] Testcase: testLockedObjectThreading25x100x100Y_Java5_Unfair took 0.506 sec
    [junit] Testcase: testLockedObjectThreading5x1000x10000N_Int01_Fair took 0.611 sec
    [junit] Testcase: testLockedObjectThreading5x1000x10000N_Int01_Unfair took 0.684 sec
    [junit] Testcase: testLockedObjectThreading5x1000x10000N_Java5_Fair took 0.724 sec
    [junit] Testcase: testLockedObjectThreading5x1000x10000N_Java5_Unfair took 0.907 sec
    [junit] Tests run: 12, Failures: 0, Errors: 0, Time elapsed: 10.107 sec
    [junit] 
    [junit] ------------- Standard Error -----------------
    [junit] ++++ TestCase.setUp: com.jogamp.common.util.locks.TestRecursiveLock01 - testLockedObjectThreading25x100x100N_Int01_Fair
    [junit] 
    [junit] ---- TestRecursiveLock01.testLockedObjectThreading: i Int01, fair  , threads 25, loops-outter    100, loops-inner    100, yield  NONE - dt    807 ms, avrg  2018876 ns, deviation [ -2014376 ..  1004784 ] ns
    [junit] ++++ TestCase.tearDown: com.jogamp.common.util.locks.TestRecursiveLock01 - testLockedObjectThreading25x100x100N_Int01_Fair
    [junit] ++++ TestCase.setUp: com.jogamp.common.util.locks.TestRecursiveLock01 - testLockedObjectThreading25x100x100N_Int01_Unfair
    [junit] 
    [junit] ---- TestRecursiveLock01.testLockedObjectThreading: i Int01, unfair, threads 25, loops-outter    100, loops-inner    100, yield  NONE - dt    389 ms, avrg    18789 ns, deviation [   -15359 ..   259321 ] ns
    [junit] ++++ TestCase.tearDown: com.jogamp.common.util.locks.TestRecursiveLock01 - testLockedObjectThreading25x100x100N_Int01_Unfair
    [junit] ++++ TestCase.setUp: com.jogamp.common.util.locks.TestRecursiveLock01 - testLockedObjectThreading25x100x100N_Java5_Fair
    [junit] 
    [junit] ---- TestRecursiveLock01.testLockedObjectThreading: i Java5, fair  , threads 25, loops-outter    100, loops-inner    100, yield  NONE - dt    523 ms, avrg  2129275 ns, deviation [ -2125165 ..   819445 ] ns
    [junit] ++++ TestCase.tearDown: com.jogamp.common.util.locks.TestRecursiveLock01 - testLockedObjectThreading25x100x100N_Java5_Fair
    [junit] ++++ TestCase.setUp: com.jogamp.common.util.locks.TestRecursiveLock01 - testLockedObjectThreading25x100x100N_Java5_Unfair
    [junit] 
    [junit] ---- TestRecursiveLock01.testLockedObjectThreading: i Java5, unfair, threads 25, loops-outter    100, loops-inner    100, yield  NONE - dt    360 ms, avrg   119559 ns, deviation [  -116089 ..  1478131 ] ns
    [junit] ++++ TestCase.tearDown: com.jogamp.common.util.locks.TestRecursiveLock01 - testLockedObjectThreading25x100x100N_Java5_Unfair
    [junit] ++++ TestCase.setUp: com.jogamp.common.util.locks.TestRecursiveLock01 - testLockedObjectThreading25x100x100Y_Int01_Fair
    [junit] 
    [junit] ---- TestRecursiveLock01.testLockedObjectThreading: i Int01, fair  , threads 25, loops-outter    100, loops-inner    100, yield YIELD - dt   3205 ms, avrg 30009958 ns, deviation [  -686008 ..   773882 ] ns
    [junit] ++++ TestCase.tearDown: com.jogamp.common.util.locks.TestRecursiveLock01 - testLockedObjectThreading25x100x100Y_Int01_Fair
    [junit] ++++ TestCase.setUp: com.jogamp.common.util.locks.TestRecursiveLock01 - testLockedObjectThreading25x100x100Y_Int01_Unair
    [junit] 
    [junit] ---- TestRecursiveLock01.testLockedObjectThreading: i Int01, unfair, threads 25, loops-outter    100, loops-inner    100, yield YIELD - dt    789 ms, avrg  6749706 ns, deviation [  -158726 ..    61134 ] ns
    [junit] ++++ TestCase.tearDown: com.jogamp.common.util.locks.TestRecursiveLock01 - testLockedObjectThreading25x100x100Y_Int01_Unair
    [junit] ++++ TestCase.setUp: com.jogamp.common.util.locks.TestRecursiveLock01 - testLockedObjectThreading25x100x100Y_Java5_Fair
    [junit] 
    [junit] ---- TestRecursiveLock01.testLockedObjectThreading: i Java5, fair  , threads 25, loops-outter    100, loops-inner    100, yield YIELD - dt    522 ms, avrg  4089881 ns, deviation [   -48671 ..    40579 ] ns
    [junit] ++++ TestCase.tearDown: com.jogamp.common.util.locks.TestRecursiveLock01 - testLockedObjectThreading25x100x100Y_Java5_Fair
    [junit] ++++ TestCase.setUp: com.jogamp.common.util.locks.TestRecursiveLock01 - testLockedObjectThreading25x100x100Y_Java5_Unfair
    [junit] 
    [junit] ---- TestRecursiveLock01.testLockedObjectThreading: i Java5, unfair, threads 25, loops-outter    100, loops-inner    100, yield YIELD - dt    504 ms, avrg 10290489 ns, deviation [ -7316929 .. 11875831 ] ns
    [junit] ++++ TestCase.tearDown: com.jogamp.common.util.locks.TestRecursiveLock01 - testLockedObjectThreading25x100x100Y_Java5_Unfair
    [junit] ++++ TestCase.setUp: com.jogamp.common.util.locks.TestRecursiveLock01 - testLockedObjectThreading5x1000x10000N_Int01_Fair
    [junit] 
    [junit] ---- TestRecursiveLock01.testLockedObjectThreading: i Int01, fair  , threads  5, loops-outter   1000, loops-inner  10000, yield  NONE - dt    610 ms, avrg   147926 ns, deviation [   -20613 ..    18149 ] ns
    [junit] ++++ TestCase.tearDown: com.jogamp.common.util.locks.TestRecursiveLock01 - testLockedObjectThreading5x1000x10000N_Int01_Fair
    [junit] ++++ TestCase.setUp: com.jogamp.common.util.locks.TestRecursiveLock01 - testLockedObjectThreading5x1000x10000N_Int01_Unfair
    [junit] 
    [junit] ---- TestRecursiveLock01.testLockedObjectThreading: i Int01, unfair, threads  5, loops-outter   1000, loops-inner  10000, yield  NONE - dt    683 ms, avrg     7939 ns, deviation [    -5513 ..     8552 ] ns
    [junit] ++++ TestCase.tearDown: com.jogamp.common.util.locks.TestRecursiveLock01 - testLockedObjectThreading5x1000x10000N_Int01_Unfair
    [junit] ++++ TestCase.setUp: com.jogamp.common.util.locks.TestRecursiveLock01 - testLockedObjectThreading5x1000x10000N_Java5_Fair
    [junit] 
    [junit] ---- TestRecursiveLock01.testLockedObjectThreading: i Java5, fair  , threads  5, loops-outter   1000, loops-inner  10000, yield  NONE - dt    724 ms, avrg   537848 ns, deviation [   -15367 ..    12908 ] ns
    [junit] ++++ TestCase.tearDown: com.jogamp.common.util.locks.TestRecursiveLock01 - testLockedObjectThreading5x1000x10000N_Java5_Fair
    [junit] ++++ TestCase.setUp: com.jogamp.common.util.locks.TestRecursiveLock01 - testLockedObjectThreading5x1000x10000N_Java5_Unfair
    [junit] 
    [junit] ---- TestRecursiveLock01.testLockedObjectThreading: i Java5, unfair, threads  5, loops-outter   1000, loops-inner  10000, yield  NONE - dt    907 ms, avrg     4205 ns, deviation [    -3856 ..    13252 ] ns
    [junit] ++++ TestCase.tearDown: com.jogamp.common.util.locks.TestRecursiveLock01 - testLockedObjectThreading5x1000x10000N_Java5_Unfair
    [junit] ------------- ---------------- ---------------
    [junit] Testsuite: com.jogamp.common.util.locks.TestRecursiveThreadGroupLock01
    [junit] ++++ TestCase.setUp: com.jogamp.common.util.locks.TestRecursiveThreadGroupLock01 - testTwoThreadsInGroup
    [junit] Testsuite: com.jogamp.common.util.locks.TestRecursiveThreadGroupLock01
    [junit] 
    [junit] ---- TestRecursiveLock01.testLockedObjectThreading: i Int02ThreadGroup, fair  , threads  5, loops-outter   1000, loops-inner  10000, yield YIELD - dt    146 ms
    [junit] ++++ TestCase.tearDown: com.jogamp.common.util.locks.TestRecursiveThreadGroupLock01 - testTwoThreadsInGroup
    [junit] Tests run: 1, Failures: 0, Errors: 0, Time elapsed: 0.295 sec
    [junit] ------------- Standard Error -----------------
    [junit] ++++ TestCase.setUp: com.jogamp.common.util.locks.TestRecursiveThreadGroupLock01 - testTwoThreadsInGroup
    [junit] 
    [junit] ---- TestRecursiveLock01.testLockedObjectThreading: i Int02ThreadGroup, fair  , threads  5, loops-outter   1000, loops-inner  10000, yield YIELD - dt    146 ms
    [junit] ++++ TestCase.tearDown: com.jogamp.common.util.locks.TestRecursiveThreadGroupLock01 - testTwoThreadsInGroup
    [junit] ------------- ---------------- ---------------
    [junit] 
    [junit] Testcase: testTwoThreadsInGroup took 0.147 sec
    [junit] Tests run: 1, Failures: 0, Errors: 0, Time elapsed: 0.295 sec
    [junit] 
    [junit] ------------- Standard Error -----------------
    [junit] ++++ TestCase.setUp: com.jogamp.common.util.locks.TestRecursiveThreadGroupLock01 - testTwoThreadsInGroup
    [junit] 
    [junit] ---- TestRecursiveLock01.testLockedObjectThreading: i Int02ThreadGroup, fair  , threads  5, loops-outter   1000, loops-inner  10000, yield YIELD - dt    146 ms
    [junit] ++++ TestCase.tearDown: com.jogamp.common.util.locks.TestRecursiveThreadGroupLock01 - testTwoThreadsInGroup
    [junit] ------------- ---------------- ---------------
    [junit] Testsuite: com.jogamp.common.util.locks.TestSingletonServerSocket00
    [junit] Testsuite: com.jogamp.common.util.locks.TestSingletonServerSocket00
    [junit] Thread-3 - SISock: localhost/127.0.0.1:59999 - started
    [junit] SLOCK [T main @ 1404397531026 ms +++ localhost/127.0.0.1:59999 - Locked within 22 ms, 1 attempts
    [junit] SLOCK [T main @ 1404397531033 ms III localhost/127.0.0.1:59999 - Wait for lock
    [junit] SLOCK [T main @ 1404397532048 ms +++ EEE (2) localhost/127.0.0.1:59999 - couldn't get lock within 1016 ms, 10 attempts
    [junit] SLOCK [T main @ 1404397532084 ms --- localhost/127.0.0.1:59999 - Unlock ok within 1 ms
    [junit] Thread-5 - SISock: localhost/127.0.0.1:59999 - started
    [junit] SLOCK [T main @ 1404397532085 ms +++ localhost/127.0.0.1:59999 - Locked within 1 ms, 1 attempts
    [junit] SLOCK [T main @ 1404397532119 ms --- localhost/127.0.0.1:59999 - Unlock ok within 0 ms
    [junit] Thread-6 - SISock: localhost/127.0.0.1:59999 - started
    [junit] SLOCK [T main @ 1404397532121 ms +++ localhost/127.0.0.1:59999 - Locked within 0 ms, 1 attempts
    [junit] LockUnlock #1 LOCK try ..
    [junit] LockUnlock #2 LOCK try ..
    [junit] SLOCK [T LockUnlock #2 @ 1404397532123 ms III localhost/127.0.0.1:59999 - Wait for lock
    [junit] SLOCK [T LockUnlock #1 @ 1404397532123 ms III localhost/127.0.0.1:59999 - Wait for lock
    [junit] SLOCK [T main @ 1404397532459 ms --- localhost/127.0.0.1:59999 - Unlock ok within 0 ms
    [junit] SLOCK [T LockUnlock #2 @ 1404397533238 ms +++ EEE (2) localhost/127.0.0.1:59999 - couldn't get lock within 1116 ms, 3 attempts
    [junit] Exception in thread "LockUnlock #2" java.lang.AssertionError: LockUnlock #2 - Could not lock instance: localhost/127.0.0.1:59999
    [junit] 	at org.junit.Assert.fail(Assert.java:88)
    [junit] 	at org.junit.Assert.assertTrue(Assert.java:41)
    [junit] 	at com.jogamp.common.util.locks.TestSingletonServerSocket00$1.run(TestSingletonServerSocket00.java:74)
    [junit] 	at java.lang.Thread.run(Thread.java:745)
    [junit] SLOCK [T LockUnlock #1 @ 1404397533340 ms +++ EEE (2) localhost/127.0.0.1:59999 - couldn't get lock within 1218 ms, 9 attempts
    [junit] Exception in thread "LockUnlock #1" java.lang.AssertionError: LockUnlock #1 - Could not lock instance: localhost/127.0.0.1:59999
    [junit] 	at org.junit.Assert.fail(Assert.java:88)
    [junit] 	at org.junit.Assert.assertTrue(Assert.java:41)
    [junit] 	at com.jogamp.common.util.locks.TestSingletonServerSocket00$1.run(TestSingletonServerSocket00.java:74)
    [junit] 	at java.lang.Thread.run(Thread.java:745)
    [junit] Tests run: 3, Failures: 0, Errors: 0, Time elapsed: 2.395 sec
    [junit] ------------- Standard Error -----------------
    [junit] Thread-3 - SISock: localhost/127.0.0.1:59999 - started
    [junit] SLOCK [T main @ 1404397531026 ms +++ localhost/127.0.0.1:59999 - Locked within 22 ms, 1 attempts
    [junit] SLOCK [T main @ 1404397531033 ms III localhost/127.0.0.1:59999 - Wait for lock
    [junit] SLOCK [T main @ 1404397532048 ms +++ EEE (2) localhost/127.0.0.1:59999 - couldn't get lock within 1016 ms, 10 attempts
    [junit] SLOCK [T main @ 1404397532084 ms --- localhost/127.0.0.1:59999 - Unlock ok within 1 ms
    [junit] Thread-5 - SISock: localhost/127.0.0.1:59999 - started
    [junit] SLOCK [T main @ 1404397532085 ms +++ localhost/127.0.0.1:59999 - Locked within 1 ms, 1 attempts
    [junit] SLOCK [T main @ 1404397532119 ms --- localhost/127.0.0.1:59999 - Unlock ok within 0 ms
    [junit] Thread-6 - SISock: localhost/127.0.0.1:59999 - started
    [junit] SLOCK [T main @ 1404397532121 ms +++ localhost/127.0.0.1:59999 - Locked within 0 ms, 1 attempts
    [junit] LockUnlock #1 LOCK try ..
    [junit] LockUnlock #2 LOCK try ..
    [junit] SLOCK [T LockUnlock #2 @ 1404397532123 ms III localhost/127.0.0.1:59999 - Wait for lock
    [junit] SLOCK [T LockUnlock #1 @ 1404397532123 ms III localhost/127.0.0.1:59999 - Wait for lock
    [junit] SLOCK [T main @ 1404397532459 ms --- localhost/127.0.0.1:59999 - Unlock ok within 0 ms
    [junit] SLOCK [T LockUnlock #2 @ 1404397533238 ms +++ EEE (2) localhost/127.0.0.1:59999 - couldn't get lock within 1116 ms, 3 attempts
    [junit] Exception in thread "LockUnlock #2" java.lang.AssertionError: LockUnlock #2 - Could not lock instance: localhost/127.0.0.1:59999
    [junit] 	at org.junit.Assert.fail(Assert.java:88)
    [junit] 	at org.junit.Assert.assertTrue(Assert.java:41)
    [junit] 	at com.jogamp.common.util.locks.TestSingletonServerSocket00$1.run(TestSingletonServerSocket00.java:74)
    [junit] 	at java.lang.Thread.run(Thread.java:745)
    [junit] SLOCK [T LockUnlock #1 @ 1404397533340 ms +++ EEE (2) localhost/127.0.0.1:59999 - couldn't get lock within 1218 ms, 9 attempts
    [junit] Exception in thread "LockUnlock #1" java.lang.AssertionError: LockUnlock #1 - Could not lock instance: localhost/127.0.0.1:59999
    [junit] 	at org.junit.Assert.fail(Assert.java:88)
    [junit] 	at org.junit.Assert.assertTrue(Assert.java:41)
    [junit] 	at com.jogamp.common.util.locks.TestSingletonServerSocket00$1.run(TestSingletonServerSocket00.java:74)
    [junit] 	at java.lang.Thread.run(Thread.java:745)
    [junit] ------------- ---------------- ---------------
    [junit] 
    [junit] Testcase: test2ndInstanceLockTimeout took 1.08 sec
    [junit] Testcase: testLockUnlock took 0.035 sec
    [junit] Testcase: testOffthreadLockUnlock took 1.256 sec
    [junit] Tests run: 3, Failures: 0, Errors: 0, Time elapsed: 2.395 sec
    [junit] 
    [junit] ------------- Standard Error -----------------
    [junit] Thread-3 - SISock: localhost/127.0.0.1:59999 - started
    [junit] SLOCK [T main @ 1404397531026 ms +++ localhost/127.0.0.1:59999 - Locked within 22 ms, 1 attempts
    [junit] SLOCK [T main @ 1404397531033 ms III localhost/127.0.0.1:59999 - Wait for lock
    [junit] SLOCK [T main @ 1404397532048 ms +++ EEE (2) localhost/127.0.0.1:59999 - couldn't get lock within 1016 ms, 10 attempts
    [junit] SLOCK [T main @ 1404397532084 ms --- localhost/127.0.0.1:59999 - Unlock ok within 1 ms
    [junit] Thread-5 - SISock: localhost/127.0.0.1:59999 - started
    [junit] SLOCK [T main @ 1404397532085 ms +++ localhost/127.0.0.1:59999 - Locked within 1 ms, 1 attempts
    [junit] SLOCK [T main @ 1404397532119 ms --- localhost/127.0.0.1:59999 - Unlock ok within 0 ms
    [junit] Thread-6 - SISock: localhost/127.0.0.1:59999 - started
    [junit] SLOCK [T main @ 1404397532121 ms +++ localhost/127.0.0.1:59999 - Locked within 0 ms, 1 attempts
    [junit] LockUnlock #1 LOCK try ..
    [junit] LockUnlock #2 LOCK try ..
    [junit] SLOCK [T LockUnlock #2 @ 1404397532123 ms III localhost/127.0.0.1:59999 - Wait for lock
    [junit] SLOCK [T LockUnlock #1 @ 1404397532123 ms III localhost/127.0.0.1:59999 - Wait for lock
    [junit] SLOCK [T main @ 1404397532459 ms --- localhost/127.0.0.1:59999 - Unlock ok within 0 ms
    [junit] SLOCK [T LockUnlock #2 @ 1404397533238 ms +++ EEE (2) localhost/127.0.0.1:59999 - couldn't get lock within 1116 ms, 3 attempts
    [junit] Exception in thread "LockUnlock #2" java.lang.AssertionError: LockUnlock #2 - Could not lock instance: localhost/127.0.0.1:59999
    [junit] 	at org.junit.Assert.fail(Assert.java:88)
    [junit] 	at org.junit.Assert.assertTrue(Assert.java:41)
    [junit] 	at com.jogamp.common.util.locks.TestSingletonServerSocket00$1.run(TestSingletonServerSocket00.java:74)
    [junit] 	at java.lang.Thread.run(Thread.java:745)
    [junit] SLOCK [T LockUnlock #1 @ 1404397533340 ms +++ EEE (2) localhost/127.0.0.1:59999 - couldn't get lock within 1218 ms, 9 attempts
    [junit] Exception in thread "LockUnlock #1" java.lang.AssertionError: LockUnlock #1 - Could not lock instance: localhost/127.0.0.1:59999
    [junit] 	at org.junit.Assert.fail(Assert.java:88)
    [junit] 	at org.junit.Assert.assertTrue(Assert.java:41)
    [junit] 	at com.jogamp.common.util.locks.TestSingletonServerSocket00$1.run(TestSingletonServerSocket00.java:74)
    [junit] 	at java.lang.Thread.run(Thread.java:745)
    [junit] ------------- ---------------- ---------------
    [junit] Testsuite: com.jogamp.common.util.locks.TestSingletonServerSocket01
    [junit] Testsuite: com.jogamp.common.util.locks.TestSingletonServerSocket01
    [junit] SLOCK [T main @ 1404397533389 ms III localhost/127.0.0.1:59999 - Wait for lock
    [junit] Thread-10 - SISock: localhost/127.0.0.1:59999 - started
    [junit] SLOCK [T main @ 1404397609693 ms +++ localhost/127.0.0.1:59999 - Locked within 76305 ms, 2 attempts
    [junit] SLOCK [T main @ 1404397609693 ms --- localhost/127.0.0.1:59999 - Unlock ok within 0 ms
    [junit] Thread-12 - SISock: localhost/127.0.0.1:59999 - started
    [junit] SLOCK [T main @ 1404397609710 ms +++ localhost/127.0.0.1:59999 - Locked within 1 ms, 1 attempts
    [junit] Tests run: 1, Failures: 0, Errors: 0, Time elapsed: 76.309 sec
    [junit] ------------- Standard Error -----------------
    [junit] SLOCK [T main @ 1404397533389 ms III localhost/127.0.0.1:59999 - Wait for lock
    [junit] Thread-10 - SISock: localhost/127.0.0.1:59999 - started
    [junit] SLOCK [T main @ 1404397609693 ms +++ localhost/127.0.0.1:59999 - Locked within 76305 ms, 2 attempts
    [junit] SLOCK [T main @ 1404397609693 ms --- localhost/127.0.0.1:59999 - Unlock ok within 0 ms
    [junit] ------------- ---------------- ---------------
    [junit] 
    [junit] Testcase: testJVMShutdown took 76.305 sec
    [junit] Tests run: 1, Failures: 0, Errors: 0, Time elapsed: 76.309 sec
    [junit] 
    [junit] ------------- Standard Error -----------------
    [junit] SLOCK [T main @ 1404397533389 ms III localhost/127.0.0.1:59999 - Wait for lock
    [junit] Thread-10 - SISock: localhost/127.0.0.1:59999 - started
    [junit] SLOCK [T main @ 1404397609693 ms +++ localhost/127.0.0.1:59999 - Locked within 76305 ms, 2 attempts
    [junit] SLOCK [T main @ 1404397609693 ms --- localhost/127.0.0.1:59999 - Unlock ok within 0 ms
    [junit] ------------- ---------------- ---------------
    [junit] Testsuite: com.jogamp.common.util.locks.TestSingletonServerSocket02
    [junit] Testsuite: com.jogamp.common.util.locks.TestSingletonServerSocket02
    [junit] Tests run: 1, Failures: 0, Errors: 0, Time elapsed: 0.047 sec
    [junit] ------------- Standard Error -----------------
    [junit] Thread-12 - SISock: localhost/127.0.0.1:59999 - started
    [junit] SLOCK [T main @ 1404397609710 ms +++ localhost/127.0.0.1:59999 - Locked within 1 ms, 1 attempts
    [junit] SLOCK [T main @ 1404397609753 ms --- localhost/127.0.0.1:59999 - Unlock ok within 0 ms
    [junit] ------------- ---------------- ---------------
    [junit] 
    [junit] Testcase: dummy took 0 sec
    [junit] Tests run: 1, Failures: 0, Errors: 0, Time elapsed: 0.047 sec
    [junit] 
    [junit] ------------- Standard Error -----------------
    [junit] Thread-12 - SISock: localhost/127.0.0.1:59999 - started
    [junit] SLOCK [T main @ 1404397609710 ms +++ localhost/127.0.0.1:59999 - Locked within 1 ms, 1 attempts
    [junit] SLOCK [T main @ 1404397609753 ms --- localhost/127.0.0.1:59999 - Unlock ok within 0 ms
    [junit] ------------- ---------------- ---------------
    [junit] SLOCK [T main @ 1404397609753 ms --- localhost/127.0.0.1:59999 - Unlock ok within 0 ms
    [junit] ++++ TestCase.setUp: com.jogamp.gluegen.test.junit.generation.PCPPTest - pcppMacroDefinitionTest
    [junit] Jul 03, 2014 4:26:49 PM com.jogamp.gluegen.pcpp.PCPP handleWarning
    [junit] WARNING: #warning "Test warning with quotes - they must have quotes" at "pcpptest.h" line "128"
    [junit] Expected: 
    [junit] -------------------------------
    [junit] #1"pcpptest.h"#defineCL_SCHAR_MIN(-127-1)#define__YES__1#16"pcpptest.h"#26"pcpptest.h"#36"pcpptest.h"cl_charGOOD_A;intGOOD_B;intGOOD_C;#40"pcpptest.h"#54"pcpptest.h"intTEST_D_GOOD;#60"pcpptest.h"#70"pcpptest.h"#77"pcpptest.h"#105"pcpptest.h"#123"pcpptest.h"intGOOD_F_1;intGOOD_F_2;#126"pcpptest.h"intGOOD_G;#128"pcpptest.h"#130"pcpptest.h"#134"pcpptest.h"#136"pcpptest.h"
    [junit] -------------------------------
    [junit] 
    [junit] Result: 
    [junit] -------------------------------
    [junit] #1"pcpptest.h"#defineCL_SCHAR_MIN(-127-1)#define__YES__1#16"pcpptest.h"#26"pcpptest.h"#36"pcpptest.h"cl_charGOOD_A;intGOOD_B;intGOOD_C;#40"pcpptest.h"#54"pcpptest.h"intTEST_D_GOOD;#60"pcpptest.h"#70"pcpptest.h"#77"pcpptest.h"#105"pcpptest.h"#123"pcpptest.h"intGOOD_F_1;intGOOD_F_2;#126"pcpptest.h"intGOOD_G;#128"pcpptest.h"#130"pcpptest.h"#134"pcpptest.h"#136"pcpptest.h"
    [junit] -------------------------------
    [junit] 
    [junit] ++++ TestCase.tearDown: com.jogamp.gluegen.test.junit.generation.PCPPTest - pcppMacroDefinitionTest
    [junit] Testsuite: com.jogamp.gluegen.test.junit.generation.PCPPTest
    [junit] Testsuite: com.jogamp.gluegen.test.junit.generation.PCPPTest
    [junit]  - - - System info - - - 
    [junit] -----------------------------------------------------------------------------------------------------
    [junit] Platform: MACOS / Mac OS X 10.9.3 (10.9.3), x86_64 (arch), GENERIC_ABI, 2 cores
    [junit] MachineDescription: runtimeValidated true, littleEndian true, 32Bit false, primitive size / alignment:
    [junit]   int8    1 / 1, int16   2 / 2
    [junit]   int     4 / 4, long    8 / 8
    [junit]   int32   4 / 4, int64   8 / 8
    [junit]   float   4 / 4, double  8 / 8, ldouble 16 / 16
    [junit]   pointer 8 / 8, page    4096
    [junit] Platform: Java Version: 1.7.0_60 (1.7.0u60), VM: Java HotSpot(TM) 64-Bit Server VM, Runtime: Java(TM) SE Runtime Environment
    [junit] Platform: Java Vendor: Oracle Corporation, http://java.oracle.com/, JavaSE: true, Java6: true, AWT enabled: true
    [junit] -----------------------------------------------------------------------------------------------------
    [junit] VM: Java HotSpot(TM) 64-Bit Server VM
    [junit] rootrel.build: build
    [junit] gluegen.root: ..
    [junit] testOutput: ../build/test
    [junit]  - - - - - - - - - - - - 
    [junit] Tests run: 1, Failures: 0, Errors: 0, Time elapsed: 0.142 sec
    [junit] ------------- Standard Output ---------------
    [junit]  - - - System info - - - 
    [junit] -----------------------------------------------------------------------------------------------------
    [junit] Platform: MACOS / Mac OS X 10.9.3 (10.9.3), x86_64 (arch), GENERIC_ABI, 2 cores
    [junit] MachineDescription: runtimeValidated true, littleEndian true, 32Bit false, primitive size / alignment:
    [junit]   int8    1 / 1, int16   2 / 2
    [junit]   int     4 / 4, long    8 / 8
    [junit]   int32   4 / 4, int64   8 / 8
    [junit]   float   4 / 4, double  8 / 8, ldouble 16 / 16
    [junit]   pointer 8 / 8, page    4096
    [junit] Platform: Java Version: 1.7.0_60 (1.7.0u60), VM: Java HotSpot(TM) 64-Bit Server VM, Runtime: Java(TM) SE Runtime Environment
    [junit] Platform: Java Vendor: Oracle Corporation, http://java.oracle.com/, JavaSE: true, Java6: true, AWT enabled: true
    [junit] -----------------------------------------------------------------------------------------------------
    [junit] VM: Java HotSpot(TM) 64-Bit Server VM
    [junit] rootrel.build: build
    [junit] gluegen.root: ..
    [junit] testOutput: ../build/test
    [junit]  - - - - - - - - - - - - 
    [junit] ------------- ---------------- ---------------
    [junit] ------------- Standard Error -----------------
    [junit] ++++ TestCase.setUp: com.jogamp.gluegen.test.junit.generation.PCPPTest - pcppMacroDefinitionTest
    [junit] Jul 03, 2014 4:26:49 PM com.jogamp.gluegen.pcpp.PCPP handleWarning
    [junit] WARNING: #warning "Test warning with quotes - they must have quotes" at "pcpptest.h" line "128"
    [junit] Expected: 
    [junit] -------------------------------
    [junit] #1"pcpptest.h"#defineCL_SCHAR_MIN(-127-1)#define__YES__1#16"pcpptest.h"#26"pcpptest.h"#36"pcpptest.h"cl_charGOOD_A;intGOOD_B;intGOOD_C;#40"pcpptest.h"#54"pcpptest.h"intTEST_D_GOOD;#60"pcpptest.h"#70"pcpptest.h"#77"pcpptest.h"#105"pcpptest.h"#123"pcpptest.h"intGOOD_F_1;intGOOD_F_2;#126"pcpptest.h"intGOOD_G;#128"pcpptest.h"#130"pcpptest.h"#134"pcpptest.h"#136"pcpptest.h"
    [junit] -------------------------------
    [junit] 
    [junit] Result: 
    [junit] -------------------------------
    [junit] #1"pcpptest.h"#defineCL_SCHAR_MIN(-127-1)#define__YES__1#16"pcpptest.h"#26"pcpptest.h"#36"pcpptest.h"cl_charGOOD_A;intGOOD_B;intGOOD_C;#40"pcpptest.h"#54"pcpptest.h"intTEST_D_GOOD;#60"pcpptest.h"#70"pcpptest.h"#77"pcpptest.h"#105"pcpptest.h"#123"pcpptest.h"intGOOD_F_1;intGOOD_F_2;#126"pcpptest.h"intGOOD_G;#128"pcpptest.h"#130"pcpptest.h"#134"pcpptest.h"#136"pcpptest.h"
    [junit] -------------------------------
    [junit] 
    [junit] ++++ TestCase.tearDown: com.jogamp.gluegen.test.junit.generation.PCPPTest - pcppMacroDefinitionTest
    [junit] ------------- ---------------- ---------------
    [junit] 
    [junit] Testcase: pcppMacroDefinitionTest took 0.058 sec
    [junit] Tests run: 1, Failures: 0, Errors: 0, Time elapsed: 0.142 sec
    [junit] 
    [junit] ------------- Standard Output ---------------
    [junit]  - - - System info - - - 
    [junit] -----------------------------------------------------------------------------------------------------
    [junit] Platform: MACOS / Mac OS X 10.9.3 (10.9.3), x86_64 (arch), GENERIC_ABI, 2 cores
    [junit] MachineDescription: runtimeValidated true, littleEndian true, 32Bit false, primitive size / alignment:
    [junit]   int8    1 / 1, int16   2 / 2
    [junit]   int     4 / 4, long    8 / 8
    [junit]   int32   4 / 4, int64   8 / 8
    [junit]   float   4 / 4, double  8 / 8, ldouble 16 / 16
    [junit]   pointer 8 / 8, page    4096
    [junit] Platform: Java Version: 1.7.0_60 (1.7.0u60), VM: Java HotSpot(TM) 64-Bit Server VM, Runtime: Java(TM) SE Runtime Environment
    [junit] Platform: Java Vendor: Oracle Corporation, http://java.oracle.com/, JavaSE: true, Java6: true, AWT enabled: true
    [junit] -----------------------------------------------------------------------------------------------------
    [junit] VM: Java HotSpot(TM) 64-Bit Server VM
    [junit] rootrel.build: build
    [junit] gluegen.root: ..
    [junit] testOutput: ../build/test
    [junit]  - - - - - - - - - - - - 
    [junit] ------------- ---------------- ---------------
    [junit] ------------- Standard Error -----------------
    [junit] ++++ TestCase.setUp: com.jogamp.gluegen.test.junit.generation.PCPPTest - pcppMacroDefinitionTest
    [junit] Jul 03, 2014 4:26:49 PM com.jogamp.gluegen.pcpp.PCPP handleWarning
    [junit] WARNING: #warning "Test warning with quotes - they must have quotes" at "pcpptest.h" line "128"
    [junit] Expected: 
    [junit] -------------------------------
    [junit] #1"pcpptest.h"#defineCL_SCHAR_MIN(-127-1)#define__YES__1#16"pcpptest.h"#26"pcpptest.h"#36"pcpptest.h"cl_charGOOD_A;intGOOD_B;intGOOD_C;#40"pcpptest.h"#54"pcpptest.h"intTEST_D_GOOD;#60"pcpptest.h"#70"pcpptest.h"#77"pcpptest.h"#105"pcpptest.h"#123"pcpptest.h"intGOOD_F_1;intGOOD_F_2;#126"pcpptest.h"intGOOD_G;#128"pcpptest.h"#130"pcpptest.h"#134"pcpptest.h"#136"pcpptest.h"
    [junit] -------------------------------
    [junit] 
    [junit] Result: 
    [junit] -------------------------------
    [junit] #1"pcpptest.h"#defineCL_SCHAR_MIN(-127-1)#define__YES__1#16"pcpptest.h"#26"pcpptest.h"#36"pcpptest.h"cl_charGOOD_A;intGOOD_B;intGOOD_C;#40"pcpptest.h"#54"pcpptest.h"intTEST_D_GOOD;#60"pcpptest.h"#70"pcpptest.h"#77"pcpptest.h"#105"pcpptest.h"#123"pcpptest.h"intGOOD_F_1;intGOOD_F_2;#126"pcpptest.h"intGOOD_G;#128"pcpptest.h"#130"pcpptest.h"#134"pcpptest.h"#136"pcpptest.h"
    [junit] -------------------------------
    [junit] 
    [junit] ++++ TestCase.tearDown: com.jogamp.gluegen.test.junit.generation.PCPPTest - pcppMacroDefinitionTest
    [junit] ------------- ---------------- ---------------
    [junit] Testsuite: com.jogamp.gluegen.test.junit.generation.Test1p1JavaEmitter
    [junit] Testsuite: com.jogamp.gluegen.test.junit.generation.Test1p1JavaEmitter
    [junit] ++++ TestCase.setUp: com.jogamp.gluegen.test.junit.generation.Test1p1JavaEmitter - chapter02TestClassExist
    [junit] ++++ TestCase.tearDown: com.jogamp.gluegen.test.junit.generation.Test1p1JavaEmitter - chapter02TestClassExist
    [junit] ++++ TestCase.setUp: com.jogamp.gluegen.test.junit.generation.Test1p1JavaEmitter - chapter03aTestCoverageFunctionalityDirectNIOAndPrimitiveArray
    [junit] Testing accessing PointerBuffer values [0..7]
    [junit]   0/8: 0x7f9181d81d30
    [junit]   1/8: 0x7f9181d81d70
    [junit]   2/8: 0x7f9181d81db0
    [junit]   3/8: 0x7f9181d81df0
    [junit]   4/8: 0x7f9181d81e30
    [junit]   5/8: 0x7f9181d81e70
    [junit]   6/8: 0x7f9181d81eb0
    [junit]   7/8: 0x7f9181d81ef0
    [junit] Testing accessing PointerBuffer values [0..7]
    [junit]   0/8: 0x7f9181d81d30
    [junit]   1/8: 0x7f9181d81d70
    [junit]   2/8: 0x7f9181d81db0
    [junit]   3/8: 0x7f9181d81df0
    [junit]   4/8: 0x7f9181d81e30
    [junit]   5/8: 0x7f9181d81e70
    [junit]   6/8: 0x7f9181d81eb0
    [junit]   7/8: 0x7f9181d81ef0
    [junit] Testing accessing PointerBuffer values [0..7]
    [junit]   0/8: 0x7f918401edf0
    [junit]   1/8: 0x7f918401ed70
    [junit]   2/8: 0x7f918401edb0
    [junit]   3/8: 0x7f9181d6ebb0
    [junit]   4/8: 0x7f9181d6ebf0
    [junit]   5/8: 0x7f9181d6ec30
    [junit]   6/8: 0x7f9181d6ec70
    [junit]   7/8: 0x7f9181dc8b60
    [junit] Testing accessing PointerBuffer values [0..7]
    [junit]   0/8: 0x7f918401edf0
    [junit]   1/8: 0x7f918401ed70
    [junit]   2/8: 0x7f918401edb0
    [junit]   3/8: 0x7f9181d6ebb0
    [junit]   4/8: 0x7f9181d6ebf0
    [junit]   5/8: 0x7f9181d6ec30
    [junit]   6/8: 0x7f9181d6ec70
    [junit]   7/8: 0x7f9181dc8b60
    [junit] Testing accessing PointerBuffer values [0..7]
    [junit]   0/8: 0x7f9181dc8be0
    [junit]   1/8: 0x7f9181dc8c20
    [junit]   2/8: 0x7f9181deffd0
    [junit]   3/8: 0x7f9181df0010
    [junit]   4/8: 0x7f9181df0050
    [junit]   5/8: 0x7f9181df0090
    [junit]   6/8: 0x7f9184017b00
    [junit]   7/8: 0x7f9184017b40
    [junit] Testing accessing PointerBuffer values [0..7]
    [junit]   0/8: 0x7f918401ee30
    [junit]   1/8: 0x7f9184017bc0
    [junit]   2/8: 0x7f9181d6d400
    [junit]   3/8: 0x7f9181d67d60
    [junit]   4/8: 0x7f9181d67da0
    [junit]   5/8: 0x7f9181d67de0
    [junit]   6/8: 0x7f9181d67e20
    [junit]   7/8: 0x7f918400f400
    [junit] Testing accessing PointerBuffer values [0..7]
    [junit]   0/8: 0x7f918401ee30
    [junit]   1/8: 0x7f9184017bc0
    [junit]   2/8: 0x7f9181d6d400
    [junit]   3/8: 0x7f9181d67d60
    [junit]   4/8: 0x7f9181d67da0
    [junit]   5/8: 0x7f9181d67de0
    [junit]   6/8: 0x7f9181d67e20
    [junit]   7/8: 0x7f918400f400
    [junit] Testing accessing PointerBuffer values [0..7]
    [junit]   0/8: 0x7f918401ee70
    [junit]   1/8: 0x7f918401ee70
    [junit]   2/8: 0x7f918401ee70
    [junit]   3/8: 0x7f918401ee70
    [junit]   4/8: 0x7f918401ee70
    [junit]   5/8: 0x7f918401ee70
    [junit]   6/8: 0x7f918401ee70
    [junit]   7/8: 0x7f918401ee70
    [junit] Testing accessing PointerBuffer values [0..7]
    [junit]   0/8: 0x4
    [junit]   1/8: 0x4
    [junit]   2/8: 0x4
    [junit]   3/8: 0x4
    [junit]   4/8: 0x4
    [junit]   5/8: 0x4
    [junit]   6/8: 0x4
    [junit]   7/8: 0x4
    [junit] ++++ TestCase.tearDown: com.jogamp.gluegen.test.junit.generation.Test1p1JavaEmitter - chapter03aTestCoverageFunctionalityDirectNIOAndPrimitiveArray
    [junit] ++++ TestCase.setUp: com.jogamp.gluegen.test.junit.generation.Test1p1JavaEmitter - chapter03bTestCoverageFunctionalityIndirectNIOAndPrimitiveArray
    [junit] Testing accessing PointerBuffer values [0..7]
    [junit]   0/8: 0x7f56923b8
    [junit]   1/8: 0x7f56923f8
    [junit]   2/8: 0x7f5692438
    [junit]   3/8: 0x7f5692478
    [junit]   4/8: 0x7f56924b8
    [junit]   5/8: 0x7f56924f8
    [junit]   6/8: 0x7f5692538
    [junit]   7/8: 0x7f5692578
    [junit] Testing accessing PointerBuffer values [0..7]
    [junit]   0/8: 0x7f56923b8
    [junit]   1/8: 0x7f56923f8
    [junit]   2/8: 0x7f5692438
    [junit]   3/8: 0x7f5692478
    [junit]   4/8: 0x7f56924b8
    [junit]   5/8: 0x7f56924f8
    [junit]   6/8: 0x7f5692538
    [junit]   7/8: 0x7f5692578
    [junit] Testing accessing PointerBuffer values [0..7]
    [junit]   0/8: 0x7f9181dfa050
    [junit]   1/8: 0x7f9181d66750
    [junit]   2/8: 0x7f9181d66790
    [junit]   3/8: 0x7f9181d667d0
    [junit]   4/8: 0x7f9181d66810
    [junit]   5/8: 0x7f9181d88710
    [junit]   6/8: 0x7f9181d88750
    [junit]   7/8: 0x7f9181d88790
    [junit] Testing accessing PointerBuffer values [0..7]
    [junit]   0/8: 0x7f9181dfa050
    [junit]   1/8: 0x7f9181d66750
    [junit]   2/8: 0x7f9181d66790
    [junit]   3/8: 0x7f9181d667d0
    [junit]   4/8: 0x7f9181d66810
    [junit]   5/8: 0x7f9181d88710
    [junit]   6/8: 0x7f9181d88750
    [junit]   7/8: 0x7f9181d88790
    [junit] Testing accessing PointerBuffer values [0..7]
    [junit]   0/8: 0x7f9181d887d0
    [junit]   1/8: 0x7f9181de9d60
    [junit]   2/8: 0x7f9181de9da0
    [junit]   3/8: 0x7f9181de9de0
    [junit]   4/8: 0x7f9181de9e20
    [junit]   5/8: 0x7f9181ded870
    [junit]   6/8: 0x7f9181ded8b0
    [junit]   7/8: 0x7f9181ded8f0
    [junit] Testing accessing PointerBuffer values [0..7]
    [junit]   0/8: 0x7f9181ded930
    [junit]   1/8: 0x7f9181ddc6b0
    [junit]   2/8: 0x7f9181ddc6f0
    [junit]   3/8: 0x7f9181ddc730
    [junit]   4/8: 0x7f9181ddc770
    [junit]   5/8: 0x7f9181d9e970
    [junit]   6/8: 0x7f9181d9e9b0
    [junit]   7/8: 0x7f9181d9e9f0
    [junit] Testing accessing PointerBuffer values [0..7]
    [junit]   0/8: 0x7f9181ded930
    [junit]   1/8: 0x7f9181ddc6b0
    [junit]   2/8: 0x7f9181ddc6f0
    [junit]   3/8: 0x7f9181ddc730
    [junit]   4/8: 0x7f9181ddc770
    [junit]   5/8: 0x7f9181d9e970
    [junit]   6/8: 0x7f9181d9e9b0
    [junit]   7/8: 0x7f9181d9e9f0
    [junit] Testing accessing PointerBuffer values [0..7]
    [junit]   0/8: 0x7f9181de9e60
    [junit]   1/8: 0x7f9181de9e60
    [junit]   2/8: 0x7f9181de9e60
    [junit]   3/8: 0x7f9181de9e60
    [junit]   4/8: 0x7f9181de9e60
    [junit]   5/8: 0x7f9181de9e60
    [junit]   6/8: 0x7f9181de9e60
    [junit]   7/8: 0x7f9181de9e60
    [junit] Testing accessing PointerBuffer values [0..7]
    [junit]   0/8: 0x4
    [junit]   1/8: 0x4
    [junit]   2/8: 0x4
    [junit]   3/8: 0x4
    [junit]   4/8: 0x4
    [junit]   5/8: 0x4
    [junit]   6/8: 0x4
    [junit]   7/8: 0x4
    [junit] ++++ TestCase.tearDown: com.jogamp.gluegen.test.junit.generation.Test1p1JavaEmitter - chapter03bTestCoverageFunctionalityIndirectNIOAndPrimitiveArray
    [junit] ++++ TestCase.setUp: com.jogamp.gluegen.test.junit.generation.Test1p1JavaEmitter - chapter04TestPointerBuffer
    [junit] Testing accessing PointerBuffer values [0..0]
    [junit]   0/1: 0xdeadbeef
    [junit] Testing accessing PointerBuffer values [0..0]
    [junit]   0/1: 0xdeadbeef
    [junit] Testing accessing PointerBuffer values [0..0]
    [junit]   0/1: 0xdeadbeef
    [junit] Testing accessing PointerBuffer values [0..0]
    [junit]   0/1: 0xdeadbeef
    [junit] Testing accessing PointerBuffer values [0..0]
    [junit]   0/1: 0xdeadbeef
    [junit] Testing accessing PointerBuffer values [0..0]
    [junit]   0/1: 0xdeadbeef
    [junit] Testing accessing PointerBuffer values [0..0]
    [junit]   0/1: 0xdeadbeef
    [junit] Testing accessing PointerBuffer values [0..0]
    [junit]   0/1: 0xdeadbeef
    [junit] ++++ TestCase.tearDown: com.jogamp.gluegen.test.junit.generation.Test1p1JavaEmitter - chapter04TestPointerBuffer
    [junit] ++++ TestCase.setUp: com.jogamp.gluegen.test.junit.generation.Test1p1JavaEmitter - chapter05TestSomeFunctionsAllIndirect
    [junit] ArrayCopy.01: [1, 2, 3, 4, 5, 6, 7, 8, 9, 0]
    [junit] ArrayCopy.02: [1, 2, 3, 4, 5, 6, 7, 8, 9, 0], java.nio.HeapIntBuffer[pos=0 lim=10 cap=10]
    [junit] ArrayCopy.03: [4, 5, 6, 7]
    [junit] ArrayCopy.04: [0, 0, 0, 4, 5, 6, 7, 0, 0, 0]
    [junit] ArrayCopy.05: [0, 0, 0, 4, 5, 6, 7, 0, 0, 0], java.nio.HeapIntBuffer[pos=0 lim=10 cap=10]
    [junit] ++++ TestCase.tearDown: com.jogamp.gluegen.test.junit.generation.Test1p1JavaEmitter - chapter05TestSomeFunctionsAllIndirect
    [junit] ++++ TestCase.setUp: com.jogamp.gluegen.test.junit.generation.Test1p1JavaEmitter - chapter09TestCompoundAlignment
    [junit] static  md: MachineDescriptionStatic: X86_64_UNIX(2): MachineDescription: runtimeValidated false, littleEndian true, 32Bit false, primitive size / alignment:
    [junit]   int8    1 / 1, int16   2 / 2
    [junit]   int     4 / 4, long    8 / 8
    [junit]   int32   4 / 4, int64   8 / 8
    [junit]   float   4 / 4, double  8 / 8, ldouble 16 / 16
    [junit]   pointer 8 / 8, page    4096
    [junit] runtime md: MachineDescription: runtimeValidated true, littleEndian true, 32Bit false, primitive size / alignment:
    [junit]   int8    1 / 1, int16   2 / 2
    [junit]   int     4 / 4, long    8 / 8
    [junit]   int32   4 / 4, int64   8 / 8
    [junit]   float   4 / 4, double  8 / 8, ldouble 16 / 16
    [junit]   pointer 8 / 8, page    4096
    [junit] compatible static/runtime: true
    [junit] TK_ComplicatedSubSet: sizeof(): 72
    [junit] TK_ComplicatedSubSet: bits1-s offset: 0
    [junit] TK_ComplicatedSubSet:    id-s offset: 4
    [junit] TK_ComplicatedSubSet: bits2-s offset: 8
    [junit] TK_ComplicatedSubSet: long0-s offset: 16
    [junit] TK_ComplicatedSubSet: bits3-s offset: 24
    [junit] TK_ComplicatedSubSet: real0-s offset: 32
    [junit] TK_ComplicatedSubSet: bits4-s offset: 40
    [junit] TK_ComplicatedSubSet: real1-s offset: 44
    [junit] TK_ComplicatedSubSet: bits5-s offset: 48
    [junit] TK_ComplicatedSubSet: longX-s offset: 56
    [junit] TK_ComplicatedSubSet: bits6-s offset: 64
    [junit] TK_ComplicatedSuperSet: sizeof(): 168
    [junit] TK_ComplicatedSuperSet: bits1-s offset: 0
    [junit] TK_ComplicatedSuperSet:  sub1-s offset: 8
    [junit] TK_ComplicatedSuperSet: bits2-s offset: 80
    [junit] TK_ComplicatedSuperSet:  sub2-s offset: 88
    [junit] TK_ComplicatedSuperSet: bits3-s offset: 160
    [junit] createComplicatedSuperSet:
    [junit] TK_ComplicatedSuperSet [
    [junit]   cs.b1         0xA0
    [junit]   cs.sub1.b1    0xA1
    [junit]   cs.sub1.id    0x12345678
    [junit]   cs.sub1.b2    0xA2
    [junit]   cs.sub1.long0 0x123456789ABCDEF0
    [junit]   cs.sub1.b3    0xA3
    [junit]   cs.sub1.real0 3.14159 0X1.921FB54442D18P+1
    [junit]   cs.sub1.b4    0xA4
    [junit]   cs.sub1.real1 256.123 0X1.001F9AP+8
    [junit]   cs.sub1.b5    0xA5
    [junit]   cs.sub1.longX 0xDEADBEEF
    [junit]   cs.sub1.b6    0xA6
    [junit]   cs.b2         0xB0
    [junit]   cs.sub2.b1    0xB1
    [junit]   cs.sub2.id    0x12345678
    [junit]   cs.sub2.b2    0xB2
    [junit]   cs.sub2.long0 0x123456789ABCDEF0
    [junit]   cs.sub2.b3    0xB3
    [junit]   cs.sub2.real0 3.14159 0X1.921FB54442D18P+1
    [junit]   cs.sub2.b4    0xB4
    [junit]   cs.sub2.real1 256.123 0X1.001F9AP+8
    [junit]   cs.sub2.b5    0xB5
    [junit]   cs.sub2.longX 0xDEADBEEF
    [junit]   cs.sub2.b6    0xB6
    [junit]   cs.b3         0xC0
    [junit] ]
    [junit] 
    [junit] hasInitValues res 1:
    [junit] TK_ComplicatedSuperSet [
    [junit]   cs.b1         0xA0
    [junit]   cs.sub1.b1    0xA1
    [junit]   cs.sub1.id    0x12345678
    [junit]   cs.sub1.b2    0xA2
    [junit]   cs.sub1.long0 0x123456789ABCDEF0
    [junit]   cs.sub1.b3    0xA3
    [junit]   cs.sub1.real0 3.14159 0X1.921FB54442D18P+1
    [junit]   cs.sub1.b4    0xA4
    [junit]   cs.sub1.real1 256.123 0X1.001F9AP+8
    [junit]   cs.sub1.b5    0xA5
    [junit]   cs.sub1.longX 0xDEADBEEF
    [junit]   cs.sub1.b6    0xA6
    [junit]   cs.b2         0xB0
    [junit]   cs.sub2.b1    0xB1
    [junit]   cs.sub2.id    0x12345678
    [junit]   cs.sub2.b2    0xB2
    [junit]   cs.sub2.long0 0x123456789ABCDEF0
    [junit]   cs.sub2.b3    0xB3
    [junit]   cs.sub2.real0 3.14159 0X1.921FB54442D18P+1
    [junit]   cs.sub2.b4    0xB4
    [junit]   cs.sub2.real1 256.123 0X1.001F9AP+8
    [junit]   cs.sub2.b5    0xB5
    [junit]   cs.sub2.longX 0xDEADBEEF
    [junit]   cs.sub2.b6    0xB6
    [junit]   cs.b3         0xC0
    [junit] ]
    [junit] 
    [junit] ++++ TestCase.tearDown: com.jogamp.gluegen.test.junit.generation.Test1p1JavaEmitter - chapter09TestCompoundAlignment
    [junit] ++++ TestCase.setUp: com.jogamp.gluegen.test.junit.generation.Test1p1JavaEmitter - chapter10TestCompoundCallByReference
    [junit] 0x123456789abcdef0 == 0x123456789abcdef0
    [junit] 0xa23456781abcdef0 == 0xa23456781abcdef0
    [junit] 0xb23456782abcdef0 == 0xb23456782abcdef0
    [junit] 0x123456789abcdef0 == 0x123456789abcdef0
    [junit] 0xa23456781abcdef0 == 0xa23456781abcdef0
    [junit] 0xb23456782abcdef0 == 0xb23456782abcdef0
    [junit] 0x123456789abcdef0 == 0x123456789abcdef0
    [junit] 0xa23456781abcdef0 == 0xa23456781abcdef0
    [junit] 0xb23456782abcdef0 == 0xb23456782abcdef0
    [junit] 0x123456789abcdef0 == 0x123456789abcdef0
    [junit] 0xa23456781abcdef0 == 0xa23456781abcdef0
    [junit] 0xb23456782abcdef0 == 0xb23456782abcdef0
    [junit] ch10: ref-dim 286331153/572662306 858993459x1145324612
    [junit] ++++ TestCase.tearDown: com.jogamp.gluegen.test.junit.generation.Test1p1JavaEmitter - chapter10TestCompoundCallByReference
    [junit] ++++ TestCase.setUp: com.jogamp.gluegen.test.junit.generation.Test1p1JavaEmitter - chapter11TestCompoundCallByValue
    [junit] ch11.0: ref-dim 286331153/572662306 858993459x1145324612
    [junit] XXX.getSurfaceBoundsValue: dim 286331153/572662306 858993459x1145324612
    [junit] ch11.0: val-dim 286331153/572662306 858993459x1145324612
    [junit] ch11.1: val-dim 11/22 33x44
    [junit] XXX.getSurfaceBoundsValue: dim 11/22 33x44
    [junit] ch11.2: val-dim 11/22 33x44
    [junit] ch11.3: sameInstanceByVal false
    [junit] ch11.3: sameInstanceByRef false
    [junit] ch11.4: sum-dimArray 12/24 36x48
    [junit] ch11.5: dimsGet[0] 11/22 33x44
    [junit] ch11.5: dimsGet[1] 1/2 3x4
    [junit] ch11.6: sum-dimPair 12/24 36x48
    [junit] ch11.7: zero-dim[0] 0/0 0x0
    [junit] ch11.7: zero-dim[1] 0/0 0x0
    [junit] ch11.8: copyPrim2Dim 11/22 100x200
    [junit] ch11.9: copyDim2Prim 11/22 100x200
    [junit] ch11.10: expRGBAb 0x11, 0x22, 0x33, 0xffffffaa
    [junit] ch11.10: hasRGBAi 0x112233aa
    [junit] ch11.11: hasRGBAb 0x11, 0x22, 0x33, 0xffffffaa
    [junit] ch11.12: addInt 3
    [junit] ch11.13: addByte 3
    [junit] ++++ TestCase.tearDown: com.jogamp.gluegen.test.junit.generation.Test1p1JavaEmitter - chapter11TestCompoundCallByValue
    [junit] ++++ TestCase.setUp: com.jogamp.gluegen.test.junit.generation.Test1p1JavaEmitter - chapter12TestStructArrayModelConst
    [junit] 0x123456789abcdef0 == 0x123456789abcdef0
    [junit] 0x123456789abcdef0 == 0x123456789abcdef0
    [junit] has 'Hello Array'
    [junit] has   0: 0x48 H
    [junit] has   1: 0x65 e
    [junit] has   2: 0x6C l
    [junit] has   3: 0x6C l
    [junit] has   4: 0x6F o
    [junit] has   5: 0x20  
    [junit] has   6: 0x41 A
    [junit] has   7: 0x72 r
    [junit] has   8: 0x72 r
    [junit] has   9: 0x61 a
    [junit] has  10: 0x79 y
    [junit] has 'Hello CString'
    [junit] has   0: 0x48 H
    [junit] has   1: 0x65 e
    [junit] has   2: 0x6C l
    [junit] has   3: 0x6C l
    [junit] has   4: 0x6F o
    [junit] has   5: 0x20  
    [junit] has   6: 0x43 C
    [junit] has   7: 0x53 S
    [junit] has   8: 0x74 t
    [junit] has   9: 0x72 r
    [junit] has  10: 0x69 i
    [junit] has  11: 0x6E n
    [junit] has  12: 0x67 g
    [junit] has 'Hello Pointer'
    [junit] has   0: 0x48 H
    [junit] has   1: 0x65 e
    [junit] has   2: 0x6C l
    [junit] has   3: 0x6C l
    [junit] has   4: 0x6F o
    [junit] has   5: 0x20  
    [junit] has   6: 0x50 P
    [junit] has   7: 0x6F o
    [junit] has   8: 0x69 i
    [junit] has   9: 0x6E n
    [junit] has  10: 0x74 t
    [junit] has  11: 0x65 e
    [junit] has  12: 0x72 r
    [junit] ++++ TestCase.tearDown: com.jogamp.gluegen.test.junit.generation.Test1p1JavaEmitter - chapter12TestStructArrayModelConst
    [junit] ++++ TestCase.setUp: com.jogamp.gluegen.test.junit.generation.Test1p1JavaEmitter - chapter13TestStructArrayModelMutable
    [junit] 0x123456789abcdef0 == 0x123456789abcdef0
    [junit] 0x123456789abcdef0 == 0x123456789abcdef0
    [junit] ++++ TestCase.tearDown: com.jogamp.gluegen.test.junit.generation.Test1p1JavaEmitter - chapter13TestStructArrayModelMutable
    [junit] ++++ TestCase.setUp: com.jogamp.gluegen.test.junit.generation.Test1p2LoadJNIAndImplLib - chapter02TestClassExist
    [junit] ++++ TestCase.tearDown: com.jogamp.gluegen.test.junit.generation.Test1p2LoadJNIAndImplLib - chapter02TestClassExist
    [junit] Tests run: 10, Failures: 0, Errors: 0, Time elapsed: 0.242 sec
    [junit] ------------- Standard Error -----------------
    [junit] ++++ TestCase.setUp: com.jogamp.gluegen.test.junit.generation.Test1p1JavaEmitter - chapter02TestClassExist
    [junit] ++++ TestCase.tearDown: com.jogamp.gluegen.test.junit.generation.Test1p1JavaEmitter - chapter02TestClassExist
    [junit] ++++ TestCase.setUp: com.jogamp.gluegen.test.junit.generation.Test1p1JavaEmitter - chapter03aTestCoverageFunctionalityDirectNIOAndPrimitiveArray
    [junit] Testing accessing PointerBuffer values [0..7]
    [junit]   0/8: 0x7f9181d81d30
    [junit]   1/8: 0x7f9181d81d70
    [junit]   2/8: 0x7f9181d81db0
    [junit]   3/8: 0x7f9181d81df0
    [junit]   4/8: 0x7f9181d81e30
    [junit]   5/8: 0x7f9181d81e70
    [junit]   6/8: 0x7f9181d81eb0
    [junit]   7/8: 0x7f9181d81ef0
    [junit] Testing accessing PointerBuffer values [0..7]
    [junit]   0/8: 0x7f9181d81d30
    [junit]   1/8: 0x7f9181d81d70
    [junit]   2/8: 0x7f9181d81db0
    [junit]   3/8: 0x7f9181d81df0
    [junit]   4/8: 0x7f9181d81e30
    [junit]   5/8: 0x7f9181d81e70
    [junit]   6/8: 0x7f9181d81eb0
    [junit]   7/8: 0x7f9181d81ef0
    [junit] Testing accessing PointerBuffer values [0..7]
    [junit]   0/8: 0x7f918401edf0
    [junit]   1/8: 0x7f918401ed70
    [junit]   2/8: 0x7f918401edb0
    [junit]   3/8: 0x7f9181d6ebb0
    [junit]   4/8: 0x7f9181d6ebf0
    [junit]   5/8: 0x7f9181d6ec30
    [junit]   6/8: 0x7f9181d6ec70
    [junit]   7/8: 0x7f9181dc8b60
    [junit] Testing accessing PointerBuffer values [0..7]
    [junit]   0/8: 0x7f918401edf0
    [junit]   1/8: 0x7f918401ed70
    [junit]   2/8: 0x7f918401edb0
    [junit]   3/8: 0x7f9181d6ebb0
    [junit]   4/8: 0x7f9181d6ebf0
    [junit]   5/8: 0x7f9181d6ec30
    [junit]   6/8: 0x7f9181d6ec70
    [junit]   7/8: 0x7f9181dc8b60
    [junit] Testing accessing PointerBuffer values [0..7]
    [junit]   0/8: 0x7f9181dc8be0
    [junit]   1/8: 0x7f9181dc8c20
    [junit]   2/8: 0x7f9181deffd0
    [junit]   3/8: 0x7f9181df0010
    [junit]   4/8: 0x7f9181df0050
    [junit]   5/8: 0x7f9181df0090
    [junit]   6/8: 0x7f9184017b00
    [junit]   7/8: 0x7f9184017b40
    [junit] Testing accessing PointerBuffer values [0..7]
    [junit]   0/8: 0x7f918401ee30
    [junit]   1/8: 0x7f9184017bc0
    [junit]   2/8: 0x7f9181d6d400
    [junit]   3/8: 0x7f9181d67d60
    [junit]   4/8: 0x7f9181d67da0
    [junit]   5/8: 0x7f9181d67de0
    [junit]   6/8: 0x7f9181d67e20
    [junit]   7/8: 0x7f918400f400
    [junit] Testing accessing PointerBuffer values [0..7]
    [junit]   0/8: 0x7f918401ee30
    [junit]   1/8: 0x7f9184017bc0
    [junit]   2/8: 0x7f9181d6d400
    [junit]   3/8: 0x7f9181d67d60
    [junit]   4/8: 0x7f9181d67da0
    [junit]   5/8: 0x7f9181d67de0
    [junit]   6/8: 0x7f9181d67e20
    [junit]   7/8: 0x7f918400f400
    [junit] Testing accessing PointerBuffer values [0..7]
    [junit]   0/8: 0x7f918401ee70
    [junit]   1/8: 0x7f918401ee70
    [junit]   2/8: 0x7f918401ee70
    [junit]   3/8: 0x7f918401ee70
    [junit]   4/8: 0x7f918401ee70
    [junit]   5/8: 0x7f918401ee70
    [junit]   6/8: 0x7f918401ee70
    [junit]   7/8: 0x7f918401ee70
    [junit] Testing accessing PointerBuffer values [0..7]
    [junit]   0/8: 0x4
    [junit]   1/8: 0x4
    [junit]   2/8: 0x4
    [junit]   3/8: 0x4
    [junit]   4/8: 0x4
    [junit]   5/8: 0x4
    [junit]   6/8: 0x4
    [junit]   7/8: 0x4
    [junit] ++++ TestCase.tearDown: com.jogamp.gluegen.test.junit.generation.Test1p1JavaEmitter - chapter03aTestCoverageFunctionalityDirectNIOAndPrimitiveArray
    [junit] ++++ TestCase.setUp: com.jogamp.gluegen.test.junit.generation.Test1p1JavaEmitter - chapter03bTestCoverageFunctionalityIndirectNIOAndPrimitiveArray
    [junit] Testing accessing PointerBuffer values [0..7]
    [junit]   0/8: 0x7f56923b8
    [junit]   1/8: 0x7f56923f8
    [junit]   2/8: 0x7f5692438
    [junit]   3/8: 0x7f5692478
    [junit]   4/8: 0x7f56924b8
    [junit]   5/8: 0x7f56924f8
    [junit]   6/8: 0x7f5692538
    [junit]   7/8: 0x7f5692578
    [junit] Testing accessing PointerBuffer values [0..7]
    [junit]   0/8: 0x7f56923b8
    [junit]   1/8: 0x7f56923f8
    [junit]   2/8: 0x7f5692438
    [junit]   3/8: 0x7f5692478
    [junit]   4/8: 0x7f56924b8
    [junit]   5/8: 0x7f56924f8
    [junit]   6/8: 0x7f5692538
    [junit]   7/8: 0x7f5692578
    [junit] Testing accessing PointerBuffer values [0..7]
    [junit]   0/8: 0x7f9181dfa050
    [junit]   1/8: 0x7f9181d66750
    [junit]   2/8: 0x7f9181d66790
    [junit]   3/8: 0x7f9181d667d0
    [junit]   4/8: 0x7f9181d66810
    [junit]   5/8: 0x7f9181d88710
    [junit]   6/8: 0x7f9181d88750
    [junit]   7/8: 0x7f9181d88790
    [junit] Testing accessing PointerBuffer values [0..7]
    [junit]   0/8: 0x7f9181dfa050
    [junit]   1/8: 0x7f9181d66750
    [junit]   2/8: 0x7f9181d66790
    [junit]   3/8: 0x7f9181d667d0
    [junit]   4/8: 0x7f9181d66810
    [junit]   5/8: 0x7f9181d88710
    [junit]   6/8: 0x7f9181d88750
    [junit]   7/8: 0x7f9181d88790
    [junit] Testing accessing PointerBuffer values [0..7]
    [junit]   0/8: 0x7f9181d887d0
    [junit]   1/8: 0x7f9181de9d60
    [junit]   2/8: 0x7f9181de9da0
    [junit]   3/8: 0x7f9181de9de0
    [junit]   4/8: 0x7f9181de9e20
    [junit]   5/8: 0x7f9181ded870
    [junit]   6/8: 0x7f9181ded8b0
    [junit]   7/8: 0x7f9181ded8f0
    [junit] Testing accessing PointerBuffer values [0..7]
    [junit]   0/8: 0x7f9181ded930
    [junit]   1/8: 0x7f9181ddc6b0
    [junit]   2/8: 0x7f9181ddc6f0
    [junit]   3/8: 0x7f9181ddc730
    [junit]   4/8: 0x7f9181ddc770
    [junit]   5/8: 0x7f9181d9e970
    [junit]   6/8: 0x7f9181d9e9b0
    [junit]   7/8: 0x7f9181d9e9f0
    [junit] Testing accessing PointerBuffer values [0..7]
    [junit]   0/8: 0x7f9181ded930
    [junit]   1/8: 0x7f9181ddc6b0
    [junit]   2/8: 0x7f9181ddc6f0
    [junit]   3/8: 0x7f9181ddc730
    [junit]   4/8: 0x7f9181ddc770
    [junit]   5/8: 0x7f9181d9e970
    [junit]   6/8: 0x7f9181d9e9b0
    [junit]   7/8: 0x7f9181d9e9f0
    [junit] Testing accessing PointerBuffer values [0..7]
    [junit]   0/8: 0x7f9181de9e60
    [junit]   1/8: 0x7f9181de9e60
    [junit]   2/8: 0x7f9181de9e60
    [junit]   3/8: 0x7f9181de9e60
    [junit]   4/8: 0x7f9181de9e60
    [junit]   5/8: 0x7f9181de9e60
    [junit]   6/8: 0x7f9181de9e60
    [junit]   7/8: 0x7f9181de9e60
    [junit] Testing accessing PointerBuffer values [0..7]
    [junit]   0/8: 0x4
    [junit]   1/8: 0x4
    [junit]   2/8: 0x4
    [junit]   3/8: 0x4
    [junit]   4/8: 0x4
    [junit]   5/8: 0x4
    [junit]   6/8: 0x4
    [junit]   7/8: 0x4
    [junit] ++++ TestCase.tearDown: com.jogamp.gluegen.test.junit.generation.Test1p1JavaEmitter - chapter03bTestCoverageFunctionalityIndirectNIOAndPrimitiveArray
    [junit] ++++ TestCase.setUp: com.jogamp.gluegen.test.junit.generation.Test1p1JavaEmitter - chapter04TestPointerBuffer
    [junit] Testing accessing PointerBuffer values [0..0]
    [junit]   0/1: 0xdeadbeef
    [junit] Testing accessing PointerBuffer values [0..0]
    [junit]   0/1: 0xdeadbeef
    [junit] Testing accessing PointerBuffer values [0..0]
    [junit]   0/1: 0xdeadbeef
    [junit] Testing accessing PointerBuffer values [0..0]
    [junit]   0/1: 0xdeadbeef
    [junit] Testing accessing PointerBuffer values [0..0]
    [junit]   0/1: 0xdeadbeef
    [junit] Testing accessing PointerBuffer values [0..0]
    [junit]   0/1: 0xdeadbeef
    [junit] Testing accessing PointerBuffer values [0..0]
    [junit]   0/1: 0xdeadbeef
    [junit] Testing accessing PointerBuffer values [0..0]
    [junit]   0/1: 0xdeadbeef
    [junit] ++++ TestCase.tearDown: com.jogamp.gluegen.test.junit.generation.Test1p1JavaEmitter - chapter04TestPointerBuffer
    [junit] ++++ TestCase.setUp: com.jogamp.gluegen.test.junit.generation.Test1p1JavaEmitter - chapter05TestSomeFunctionsAllIndirect
    [junit] ArrayCopy.01: [1, 2, 3, 4, 5, 6, 7, 8, 9, 0]
    [junit] ArrayCopy.02: [1, 2, 3, 4, 5, 6, 7, 8, 9, 0], java.nio.HeapIntBuffer[pos=0 lim=10 cap=10]
    [junit] ArrayCopy.03: [4, 5, 6, 7]
    [junit] ArrayCopy.04: [0, 0, 0, 4, 5, 6, 7, 0, 0, 0]
    [junit] ArrayCopy.05: [0, 0, 0, 4, 5, 6, 7, 0, 0, 0], java.nio.HeapIntBuffer[pos=0 lim=10 cap=10]
    [junit] ++++ TestCase.tearDown: com.jogamp.gluegen.test.junit.generation.Test1p1JavaEmitter - chapter05TestSomeFunctionsAllIndirect
    [junit] ++++ TestCase.setUp: com.jogamp.gluegen.test.junit.generation.Test1p1JavaEmitter - chapter09TestCompoundAlignment
    [junit] static  md: MachineDescriptionStatic: X86_64_UNIX(2): MachineDescription: runtimeValidated false, littleEndian true, 32Bit false, primitive size / alignment:
    [junit]   int8    1 / 1, int16   2 / 2
    [junit]   int     4 / 4, long    8 / 8
    [junit]   int32   4 / 4, int64   8 / 8
    [junit]   float   4 / 4, double  8 / 8, ldouble 16 / 16
    [junit]   pointer 8 / 8, page    4096
    [junit] runtime md: MachineDescription: runtimeValidated true, littleEndian true, 32Bit false, primitive size / alignment:
    [junit]   int8    1 / 1, int16   2 / 2
    [junit]   int     4 / 4, long    8 / 8
    [junit]   int32   4 / 4, int64   8 / 8
    [junit]   float   4 / 4, double  8 / 8, ldouble 16 / 16
    [junit]   pointer 8 / 8, page    4096
    [junit] compatible static/runtime: true
    [junit] ++++ TestCase.tearDown: com.jogamp.gluegen.test.junit.generation.Test1p1JavaEmitter - chapter09TestCompoundAlignment
    [junit] ++++ TestCase.setUp: com.jogamp.gluegen.test.junit.generation.Test1p1JavaEmitter - chapter10TestCompoundCallByReference
    [junit] 0x123456789abcdef0 == 0x123456789abcdef0
    [junit] 0xa23456781abcdef0 == 0xa23456781abcdef0
    [junit] 0xb23456782abcdef0 == 0xb23456782abcdef0
    [junit] 0x123456789abcdef0 == 0x123456789abcdef0
    [junit] 0xa23456781abcdef0 == 0xa23456781abcdef0
    [junit] 0xb23456782abcdef0 == 0xb23456782abcdef0
    [junit] 0x123456789abcdef0 == 0x123456789abcdef0
    [junit] 0xa23456781abcdef0 == 0xa23456781abcdef0
    [junit] 0xb23456782abcdef0 == 0xb23456782abcdef0
    [junit] 0x123456789abcdef0 == 0x123456789abcdef0
    [junit] 0xa23456781abcdef0 == 0xa23456781abcdef0
    [junit] 0xb23456782abcdef0 == 0xb23456782abcdef0
    [junit] ch10: ref-dim 286331153/572662306 858993459x1145324612
    [junit] ++++ TestCase.tearDown: com.jogamp.gluegen.test.junit.generation.Test1p1JavaEmitter - chapter10TestCompoundCallByReference
    [junit] ++++ TestCase.setUp: com.jogamp.gluegen.test.junit.generation.Test1p1JavaEmitter - chapter11TestCompoundCallByValue
    [junit] ch11.0: ref-dim 286331153/572662306 858993459x1145324612
    [junit] ch11.0: val-dim 286331153/572662306 858993459x1145324612
    [junit] ch11.1: val-dim 11/22 33x44
    [junit] ch11.2: val-dim 11/22 33x44
    [junit] ch11.3: sameInstanceByVal false
    [junit] ch11.3: sameInstanceByRef false
    [junit] ch11.4: sum-dimArray 12/24 36x48
    [junit] ch11.5: dimsGet[0] 11/22 33x44
    [junit] ch11.5: dimsGet[1] 1/2 3x4
    [junit] ch11.6: sum-dimPair 12/24 36x48
    [junit] ch11.7: zero-dim[0] 0/0 0x0
    [junit] ch11.7: zero-dim[1] 0/0 0x0
    [junit] ch11.8: copyPrim2Dim 11/22 100x200
    [junit] ch11.9: copyDim2Prim 11/22 100x200
    [junit] ch11.10: expRGBAb 0x11, 0x22, 0x33, 0xffffffaa
    [junit] ch11.10: hasRGBAi 0x112233aa
    [junit] ch11.11: hasRGBAb 0x11, 0x22, 0x33, 0xffffffaa
    [junit] ch11.12: addInt 3
    [junit] ch11.13: addByte 3
    [junit] ++++ TestCase.tearDown: com.jogamp.gluegen.test.junit.generation.Test1p1JavaEmitter - chapter11TestCompoundCallByValue
    [junit] ++++ TestCase.setUp: com.jogamp.gluegen.test.junit.generation.Test1p1JavaEmitter - chapter12TestStructArrayModelConst
    [junit] 0x123456789abcdef0 == 0x123456789abcdef0
    [junit] 0x123456789abcdef0 == 0x123456789abcdef0
    [junit] has 'Hello Array'
    [junit] has   0: 0x48 H
    [junit] has   1: 0x65 e
    [junit] has   2: 0x6C l
    [junit] has   3: 0x6C l
    [junit] has   4: 0x6F o
    [junit] has   5: 0x20  
    [junit] has   6: 0x41 A
    [junit] has   7: 0x72 r
    [junit] has   8: 0x72 r
    [junit] has   9: 0x61 a
    [junit] has  10: 0x79 y
    [junit] has 'Hello CString'
    [junit] has   0: 0x48 H
    [junit] has   1: 0x65 e
    [junit] has   2: 0x6C l
    [junit] has   3: 0x6C l
    [junit] has   4: 0x6F o
    [junit] has   5: 0x20  
    [junit] has   6: 0x43 C
    [junit] has   7: 0x53 S
    [junit] has   8: 0x74 t
    [junit] has   9: 0x72 r
    [junit] has  10: 0x69 i
    [junit] has  11: 0x6E n
    [junit] has  12: 0x67 g
    [junit] has 'Hello Pointer'
    [junit] has   0: 0x48 H
    [junit] has   1: 0x65 e
    [junit] has   2: 0x6C l
    [junit] has   3: 0x6C l
    [junit] has   4: 0x6F o
    [junit] has   5: 0x20  
    [junit] has   6: 0x50 P
    [junit] has   7: 0x6F o
    [junit] has   8: 0x69 i
    [junit] has   9: 0x6E n
    [junit] has  10: 0x74 t
    [junit] has  11: 0x65 e
    [junit] has  12: 0x72 r
    [junit] ++++ TestCase.tearDown: com.jogamp.gluegen.test.junit.generation.Test1p1JavaEmitter - chapter12TestStructArrayModelConst
    [junit] ++++ TestCase.setUp: com.jogamp.gluegen.test.junit.generation.Test1p1JavaEmitter - chapter13TestStructArrayModelMutable
    [junit] 0x123456789abcdef0 == 0x123456789abcdef0
    [junit] 0x123456789abcdef0 == 0x123456789abcdef0
    [junit] ++++ TestCase.tearDown: com.jogamp.gluegen.test.junit.generation.Test1p1JavaEmitter - chapter13TestStructArrayModelMutable
    [junit] ------------- ---------------- ---------------
    [junit] 
    [junit] Testcase: chapter02TestClassExist took 0.042 sec
    [junit] Testcase: chapter03aTestCoverageFunctionalityDirectNIOAndPrimitiveArray took 0.024 sec
    [junit] Testcase: chapter03bTestCoverageFunctionalityIndirectNIOAndPrimitiveArray took 0.003 sec
    [junit] Testcase: chapter04TestPointerBuffer took 0.005 sec
    [junit] Testcase: chapter05TestSomeFunctionsAllIndirect took 0.001 sec
    [junit] Testcase: chapter09TestCompoundAlignment took 0.003 sec
    [junit] Testcase: chapter10TestCompoundCallByReference took 0.005 sec
    [junit] Testcase: chapter11TestCompoundCallByValue took 0.006 sec
    [junit] Testcase: chapter12TestStructArrayModelConst took 0.01 sec
    [junit] Testcase: chapter13TestStructArrayModelMutable took 0.016 sec
    [junit] Tests run: 10, Failures: 0, Errors: 0, Time elapsed: 0.242 sec
    [junit] 
    [junit] ------------- Standard Error -----------------
    [junit] ++++ TestCase.setUp: com.jogamp.gluegen.test.junit.generation.Test1p1JavaEmitter - chapter02TestClassExist
    [junit] ++++ TestCase.tearDown: com.jogamp.gluegen.test.junit.generation.Test1p1JavaEmitter - chapter02TestClassExist
    [junit] ++++ TestCase.setUp: com.jogamp.gluegen.test.junit.generation.Test1p1JavaEmitter - chapter03aTestCoverageFunctionalityDirectNIOAndPrimitiveArray
    [junit] Testing accessing PointerBuffer values [0..7]
    [junit]   0/8: 0x7f9181d81d30
    [junit]   1/8: 0x7f9181d81d70
    [junit]   2/8: 0x7f9181d81db0
    [junit]   3/8: 0x7f9181d81df0
    [junit]   4/8: 0x7f9181d81e30
    [junit]   5/8: 0x7f9181d81e70
    [junit]   6/8: 0x7f9181d81eb0
    [junit]   7/8: 0x7f9181d81ef0
    [junit] Testing accessing PointerBuffer values [0..7]
    [junit]   0/8: 0x7f9181d81d30
    [junit]   1/8: 0x7f9181d81d70
    [junit]   2/8: 0x7f9181d81db0
    [junit]   3/8: 0x7f9181d81df0
    [junit]   4/8: 0x7f9181d81e30
    [junit]   5/8: 0x7f9181d81e70
    [junit]   6/8: 0x7f9181d81eb0
    [junit]   7/8: 0x7f9181d81ef0
    [junit] Testing accessing PointerBuffer values [0..7]
    [junit]   0/8: 0x7f918401edf0
    [junit]   1/8: 0x7f918401ed70
    [junit]   2/8: 0x7f918401edb0
    [junit]   3/8: 0x7f9181d6ebb0
    [junit]   4/8: 0x7f9181d6ebf0
    [junit]   5/8: 0x7f9181d6ec30
    [junit]   6/8: 0x7f9181d6ec70
    [junit]   7/8: 0x7f9181dc8b60
    [junit] Testing accessing PointerBuffer values [0..7]
    [junit]   0/8: 0x7f918401edf0
    [junit]   1/8: 0x7f918401ed70
    [junit]   2/8: 0x7f918401edb0
    [junit]   3/8: 0x7f9181d6ebb0
    [junit]   4/8: 0x7f9181d6ebf0
    [junit]   5/8: 0x7f9181d6ec30
    [junit]   6/8: 0x7f9181d6ec70
    [junit]   7/8: 0x7f9181dc8b60
    [junit] Testing accessing PointerBuffer values [0..7]
    [junit]   0/8: 0x7f9181dc8be0
    [junit]   1/8: 0x7f9181dc8c20
    [junit]   2/8: 0x7f9181deffd0
    [junit]   3/8: 0x7f9181df0010
    [junit]   4/8: 0x7f9181df0050
    [junit]   5/8: 0x7f9181df0090
    [junit]   6/8: 0x7f9184017b00
    [junit]   7/8: 0x7f9184017b40
    [junit] Testing accessing PointerBuffer values [0..7]
    [junit]   0/8: 0x7f918401ee30
    [junit]   1/8: 0x7f9184017bc0
    [junit]   2/8: 0x7f9181d6d400
    [junit]   3/8: 0x7f9181d67d60
    [junit]   4/8: 0x7f9181d67da0
    [junit]   5/8: 0x7f9181d67de0
    [junit]   6/8: 0x7f9181d67e20
    [junit]   7/8: 0x7f918400f400
    [junit] Testing accessing PointerBuffer values [0..7]
    [junit]   0/8: 0x7f918401ee30
    [junit]   1/8: 0x7f9184017bc0
    [junit]   2/8: 0x7f9181d6d400
    [junit]   3/8: 0x7f9181d67d60
    [junit]   4/8: 0x7f9181d67da0
    [junit]   5/8: 0x7f9181d67de0
    [junit]   6/8: 0x7f9181d67e20
    [junit]   7/8: 0x7f918400f400
    [junit] Testing accessing PointerBuffer values [0..7]
    [junit]   0/8: 0x7f918401ee70
    [junit]   1/8: 0x7f918401ee70
    [junit]   2/8: 0x7f918401ee70
    [junit]   3/8: 0x7f918401ee70
    [junit]   4/8: 0x7f918401ee70
    [junit]   5/8: 0x7f918401ee70
    [junit]   6/8: 0x7f918401ee70
    [junit]   7/8: 0x7f918401ee70
    [junit] Testing accessing PointerBuffer values [0..7]
    [junit]   0/8: 0x4
    [junit]   1/8: 0x4
    [junit]   2/8: 0x4
    [junit]   3/8: 0x4
    [junit]   4/8: 0x4
    [junit]   5/8: 0x4
    [junit]   6/8: 0x4
    [junit]   7/8: 0x4
    [junit] ++++ TestCase.tearDown: com.jogamp.gluegen.test.junit.generation.Test1p1JavaEmitter - chapter03aTestCoverageFunctionalityDirectNIOAndPrimitiveArray
    [junit] ++++ TestCase.setUp: com.jogamp.gluegen.test.junit.generation.Test1p1JavaEmitter - chapter03bTestCoverageFunctionalityIndirectNIOAndPrimitiveArray
    [junit] Testing accessing PointerBuffer values [0..7]
    [junit]   0/8: 0x7f56923b8
    [junit]   1/8: 0x7f56923f8
    [junit]   2/8: 0x7f5692438
    [junit]   3/8: 0x7f5692478
    [junit]   4/8: 0x7f56924b8
    [junit]   5/8: 0x7f56924f8
    [junit]   6/8: 0x7f5692538
    [junit]   7/8: 0x7f5692578
    [junit] Testing accessing PointerBuffer values [0..7]
    [junit]   0/8: 0x7f56923b8
    [junit]   1/8: 0x7f56923f8
    [junit]   2/8: 0x7f5692438
    [junit]   3/8: 0x7f5692478
    [junit]   4/8: 0x7f56924b8
    [junit]   5/8: 0x7f56924f8
    [junit]   6/8: 0x7f5692538
    [junit]   7/8: 0x7f5692578
    [junit] Testing accessing PointerBuffer values [0..7]
    [junit]   0/8: 0x7f9181dfa050
    [junit]   1/8: 0x7f9181d66750
    [junit]   2/8: 0x7f9181d66790
    [junit]   3/8: 0x7f9181d667d0
    [junit]   4/8: 0x7f9181d66810
    [junit]   5/8: 0x7f9181d88710
    [junit]   6/8: 0x7f9181d88750
    [junit]   7/8: 0x7f9181d88790
    [junit] Testing accessing PointerBuffer values [0..7]
    [junit]   0/8: 0x7f9181dfa050
    [junit]   1/8: 0x7f9181d66750
    [junit]   2/8: 0x7f9181d66790
    [junit]   3/8: 0x7f9181d667d0
    [junit]   4/8: 0x7f9181d66810
    [junit]   5/8: 0x7f9181d88710
    [junit]   6/8: 0x7f9181d88750
    [junit]   7/8: 0x7f9181d88790
    [junit] Testing accessing PointerBuffer values [0..7]
    [junit]   0/8: 0x7f9181d887d0
    [junit]   1/8: 0x7f9181de9d60
    [junit]   2/8: 0x7f9181de9da0
    [junit]   3/8: 0x7f9181de9de0
    [junit]   4/8: 0x7f9181de9e20
    [junit]   5/8: 0x7f9181ded870
    [junit]   6/8: 0x7f9181ded8b0
    [junit]   7/8: 0x7f9181ded8f0
    [junit] Testing accessing PointerBuffer values [0..7]
    [junit]   0/8: 0x7f9181ded930
    [junit]   1/8: 0x7f9181ddc6b0
    [junit]   2/8: 0x7f9181ddc6f0
    [junit]   3/8: 0x7f9181ddc730
    [junit]   4/8: 0x7f9181ddc770
    [junit]   5/8: 0x7f9181d9e970
    [junit]   6/8: 0x7f9181d9e9b0
    [junit]   7/8: 0x7f9181d9e9f0
    [junit] Testing accessing PointerBuffer values [0..7]
    [junit]   0/8: 0x7f9181ded930
    [junit]   1/8: 0x7f9181ddc6b0
    [junit]   2/8: 0x7f9181ddc6f0
    [junit]   3/8: 0x7f9181ddc730
    [junit]   4/8: 0x7f9181ddc770
    [junit]   5/8: 0x7f9181d9e970
    [junit]   6/8: 0x7f9181d9e9b0
    [junit]   7/8: 0x7f9181d9e9f0
    [junit] Testing accessing PointerBuffer values [0..7]
    [junit]   0/8: 0x7f9181de9e60
    [junit]   1/8: 0x7f9181de9e60
    [junit]   2/8: 0x7f9181de9e60
    [junit]   3/8: 0x7f9181de9e60
    [junit]   4/8: 0x7f9181de9e60
    [junit]   5/8: 0x7f9181de9e60
    [junit]   6/8: 0x7f9181de9e60
    [junit]   7/8: 0x7f9181de9e60
    [junit] Testing accessing PointerBuffer values [0..7]
    [junit]   0/8: 0x4
    [junit]   1/8: 0x4
    [junit]   2/8: 0x4
    [junit]   3/8: 0x4
    [junit]   4/8: 0x4
    [junit]   5/8: 0x4
    [junit]   6/8: 0x4
    [junit]   7/8: 0x4
    [junit] ++++ TestCase.tearDown: com.jogamp.gluegen.test.junit.generation.Test1p1JavaEmitter - chapter03bTestCoverageFunctionalityIndirectNIOAndPrimitiveArray
    [junit] ++++ TestCase.setUp: com.jogamp.gluegen.test.junit.generation.Test1p1JavaEmitter - chapter04TestPointerBuffer
    [junit] Testing accessing PointerBuffer values [0..0]
    [junit]   0/1: 0xdeadbeef
    [junit] Testing accessing PointerBuffer values [0..0]
    [junit]   0/1: 0xdeadbeef
    [junit] Testing accessing PointerBuffer values [0..0]
    [junit]   0/1: 0xdeadbeef
    [junit] Testing accessing PointerBuffer values [0..0]
    [junit]   0/1: 0xdeadbeef
    [junit] Testing accessing PointerBuffer values [0..0]
    [junit]   0/1: 0xdeadbeef
    [junit] Testing accessing PointerBuffer values [0..0]
    [junit]   0/1: 0xdeadbeef
    [junit] Testing accessing PointerBuffer values [0..0]
    [junit]   0/1: 0xdeadbeef
    [junit] Testing accessing PointerBuffer values [0..0]
    [junit]   0/1: 0xdeadbeef
    [junit] ++++ TestCase.tearDown: com.jogamp.gluegen.test.junit.generation.Test1p1JavaEmitter - chapter04TestPointerBuffer
    [junit] ++++ TestCase.setUp: com.jogamp.gluegen.test.junit.generation.Test1p1JavaEmitter - chapter05TestSomeFunctionsAllIndirect
    [junit] ArrayCopy.01: [1, 2, 3, 4, 5, 6, 7, 8, 9, 0]
    [junit] ArrayCopy.02: [1, 2, 3, 4, 5, 6, 7, 8, 9, 0], java.nio.HeapIntBuffer[pos=0 lim=10 cap=10]
    [junit] ArrayCopy.03: [4, 5, 6, 7]
    [junit] ArrayCopy.04: [0, 0, 0, 4, 5, 6, 7, 0, 0, 0]
    [junit] ArrayCopy.05: [0, 0, 0, 4, 5, 6, 7, 0, 0, 0], java.nio.HeapIntBuffer[pos=0 lim=10 cap=10]
    [junit] ++++ TestCase.tearDown: com.jogamp.gluegen.test.junit.generation.Test1p1JavaEmitter - chapter05TestSomeFunctionsAllIndirect
    [junit] ++++ TestCase.setUp: com.jogamp.gluegen.test.junit.generation.Test1p1JavaEmitter - chapter09TestCompoundAlignment
    [junit] static  md: MachineDescriptionStatic: X86_64_UNIX(2): MachineDescription: runtimeValidated false, littleEndian true, 32Bit false, primitive size / alignment:
    [junit]   int8    1 / 1, int16   2 / 2
    [junit]   int     4 / 4, long    8 / 8
    [junit]   int32   4 / 4, int64   8 / 8
    [junit]   float   4 / 4, double  8 / 8, ldouble 16 / 16
    [junit]   pointer 8 / 8, page    4096
    [junit] runtime md: MachineDescription: runtimeValidated true, littleEndian true, 32Bit false, primitive size / alignment:
    [junit]   int8    1 / 1, int16   2 / 2
    [junit]   int     4 / 4, long    8 / 8
    [junit]   int32   4 / 4, int64   8 / 8
    [junit]   float   4 / 4, double  8 / 8, ldouble 16 / 16
    [junit]   pointer 8 / 8, page    4096
    [junit] compatible static/runtime: true
    [junit] ++++ TestCase.tearDown: com.jogamp.gluegen.test.junit.generation.Test1p1JavaEmitter - chapter09TestCompoundAlignment
    [junit] ++++ TestCase.setUp: com.jogamp.gluegen.test.junit.generation.Test1p1JavaEmitter - chapter10TestCompoundCallByReference
    [junit] 0x123456789abcdef0 == 0x123456789abcdef0
    [junit] 0xa23456781abcdef0 == 0xa23456781abcdef0
    [junit] 0xb23456782abcdef0 == 0xb23456782abcdef0
    [junit] 0x123456789abcdef0 == 0x123456789abcdef0
    [junit] 0xa23456781abcdef0 == 0xa23456781abcdef0
    [junit] 0xb23456782abcdef0 == 0xb23456782abcdef0
    [junit] 0x123456789abcdef0 == 0x123456789abcdef0
    [junit] 0xa23456781abcdef0 == 0xa23456781abcdef0
    [junit] 0xb23456782abcdef0 == 0xb23456782abcdef0
    [junit] 0x123456789abcdef0 == 0x123456789abcdef0
    [junit] 0xa23456781abcdef0 == 0xa23456781abcdef0
    [junit] 0xb23456782abcdef0 == 0xb23456782abcdef0
    [junit] ch10: ref-dim 286331153/572662306 858993459x1145324612
    [junit] ++++ TestCase.tearDown: com.jogamp.gluegen.test.junit.generation.Test1p1JavaEmitter - chapter10TestCompoundCallByReference
    [junit] ++++ TestCase.setUp: com.jogamp.gluegen.test.junit.generation.Test1p1JavaEmitter - chapter11TestCompoundCallByValue
    [junit] ch11.0: ref-dim 286331153/572662306 858993459x1145324612
    [junit] ch11.0: val-dim 286331153/572662306 858993459x1145324612
    [junit] ch11.1: val-dim 11/22 33x44
    [junit] ch11.2: val-dim 11/22 33x44
    [junit] ch11.3: sameInstanceByVal false
    [junit] ch11.3: sameInstanceByRef false
    [junit] ch11.4: sum-dimArray 12/24 36x48
    [junit] ch11.5: dimsGet[0] 11/22 33x44
    [junit] ch11.5: dimsGet[1] 1/2 3x4
    [junit] ch11.6: sum-dimPair 12/24 36x48
    [junit] ch11.7: zero-dim[0] 0/0 0x0
    [junit] ch11.7: zero-dim[1] 0/0 0x0
    [junit] ch11.8: copyPrim2Dim 11/22 100x200
    [junit] ch11.9: copyDim2Prim 11/22 100x200
    [junit] ch11.10: expRGBAb 0x11, 0x22, 0x33, 0xffffffaa
    [junit] ch11.10: hasRGBAi 0x112233aa
    [junit] ch11.11: hasRGBAb 0x11, 0x22, 0x33, 0xffffffaa
    [junit] ch11.12: addInt 3
    [junit] ch11.13: addByte 3
    [junit] ++++ TestCase.tearDown: com.jogamp.gluegen.test.junit.generation.Test1p1JavaEmitter - chapter11TestCompoundCallByValue
    [junit] ++++ TestCase.setUp: com.jogamp.gluegen.test.junit.generation.Test1p1JavaEmitter - chapter12TestStructArrayModelConst
    [junit] 0x123456789abcdef0 == 0x123456789abcdef0
    [junit] 0x123456789abcdef0 == 0x123456789abcdef0
    [junit] has 'Hello Array'
    [junit] has   0: 0x48 H
    [junit] has   1: 0x65 e
    [junit] has   2: 0x6C l
    [junit] has   3: 0x6C l
    [junit] has   4: 0x6F o
    [junit] has   5: 0x20  
    [junit] has   6: 0x41 A
    [junit] has   7: 0x72 r
    [junit] has   8: 0x72 r
    [junit] has   9: 0x61 a
    [junit] has  10: 0x79 y
    [junit] has 'Hello CString'
    [junit] has   0: 0x48 H
    [junit] has   1: 0x65 e
    [junit] has   2: 0x6C l
    [junit] has   3: 0x6C l
    [junit] has   4: 0x6F o
    [junit] has   5: 0x20  
    [junit] has   6: 0x43 C
    [junit] has   7: 0x53 S
    [junit] has   8: 0x74 t
    [junit] has   9: 0x72 r
    [junit] has  10: 0x69 i
    [junit] has  11: 0x6E n
    [junit] has  12: 0x67 g
    [junit] has 'Hello Pointer'
    [junit] has   0: 0x48 H
    [junit] has   1: 0x65 e
    [junit] has   2: 0x6C l
    [junit] has   3: 0x6C l
    [junit] has   4: 0x6F o
    [junit] has   5: 0x20  
    [junit] has   6: 0x50 P
    [junit] has   7: 0x6F o
    [junit] has   8: 0x69 i
    [junit] has   9: 0x6E n
    [junit] has  10: 0x74 t
    [junit] has  11: 0x65 e
    [junit] has  12: 0x72 r
    [junit] ++++ TestCase.tearDown: com.jogamp.gluegen.test.junit.generation.Test1p1JavaEmitter - chapter12TestStructArrayModelConst
    [junit] ++++ TestCase.setUp: com.jogamp.gluegen.test.junit.generation.Test1p1JavaEmitter - chapter13TestStructArrayModelMutable
    [junit] 0x123456789abcdef0 == 0x123456789abcdef0
    [junit] 0x123456789abcdef0 == 0x123456789abcdef0
    [junit] ++++ TestCase.tearDown: com.jogamp.gluegen.test.junit.generation.Test1p1JavaEmitter - chapter13TestStructArrayModelMutable
    [junit] ------------- ---------------- ---------------
    [junit] Testsuite: com.jogamp.gluegen.test.junit.generation.Test1p2LoadJNIAndImplLib
    [junit] Testsuite: com.jogamp.gluegen.test.junit.generation.Test1p2LoadJNIAndImplLib
    [junit] ++++ TestCase.setUp: com.jogamp.gluegen.test.junit.generation.Test1p2ProcAddressEmitter - chapter02TestClassExist
    [junit] ++++ TestCase.tearDown: com.jogamp.gluegen.test.junit.generation.Test1p2ProcAddressEmitter - chapter02TestClassExist
    [junit] ++++ TestCase.setUp: com.jogamp.gluegen.test.junit.generation.Test1p2ProcAddressEmitter - chapter03aTestCoverageFunctionalityDirectNIOAndPrimitiveArray
    [junit] Testing accessing PointerBuffer values [0..7]
    [junit]   0/8: 0x7f9181d81d30
    [junit]   1/8: 0x7f9181d81d70
    [junit]   2/8: 0x7f9181d81db0
    [junit]   3/8: 0x7f9181d81df0
    [junit]   4/8: 0x7f9181d81e30
    [junit]   5/8: 0x7f9181d81e70
    [junit]   6/8: 0x7f9181d81eb0
    [junit]   7/8: 0x7f9181d81ef0
    [junit] Testing accessing PointerBuffer values [0..7]
    [junit]   0/8: 0x7f9181d81d30
    [junit]   1/8: 0x7f9181d81d70
    [junit]   2/8: 0x7f9181d81db0
    [junit]   3/8: 0x7f9181d81df0
    [junit]   4/8: 0x7f9181d81e30
    [junit]   5/8: 0x7f9181d81e70
    [junit]   6/8: 0x7f9181d81eb0
    [junit]   7/8: 0x7f9181d81ef0
    [junit] Testing accessing PointerBuffer values [0..7]
    [junit]   0/8: 0x7f9181deffd0
    [junit]   1/8: 0x7f9181df0010
    [junit]   2/8: 0x7f9181df0050
    [junit]   3/8: 0x7f9181df0090
    [junit]   4/8: 0x7f9181dc8b60
    [junit]   5/8: 0x7f9181dc8ba0
    [junit]   6/8: 0x7f9181dc8be0
    [junit]   7/8: 0x7f9181dc8c20
    [junit] Testing accessing PointerBuffer values [0..7]
    [junit]   0/8: 0x7f9181deffd0
    [junit]   1/8: 0x7f9181df0010
    [junit]   2/8: 0x7f9181df0050
    [junit]   3/8: 0x7f9181df0090
    [junit]   4/8: 0x7f9181dc8b60
    [junit]   5/8: 0x7f9181dc8ba0
    [junit]   6/8: 0x7f9181dc8be0
    [junit]   7/8: 0x7f9181dc8c20
    [junit] Testing accessing PointerBuffer values [0..7]
    [junit]   0/8: 0x7f9181d6ebf0
    [junit]   1/8: 0x7f9181d6ec30
    [junit]   2/8: 0x7f9181d6ec70
    [junit]   3/8: 0x7f9181de9d60
    [junit]   4/8: 0x7f9181de9da0
    [junit]   5/8: 0x7f9181de9de0
    [junit]   6/8: 0x7f9181de9e20
    [junit]   7/8: 0x7f9181d88710
    [junit] Testing accessing PointerBuffer values [0..7]
    [junit]   0/8: 0x7f9184013c70
    [junit]   1/8: 0x7f9181d88790
    [junit]   2/8: 0x7f9181d887d0
    [junit]   3/8: 0x7f9181d6d440
    [junit]   4/8: 0x7f9181d6d480
    [junit]   5/8: 0x7f9181d69370
    [junit]   6/8: 0x7f9181d693b0
    [junit]   7/8: 0x7f9181d693f0
    [junit] Testing accessing PointerBuffer values [0..7]
    [junit]   0/8: 0x7f9184013c70
    [junit]   1/8: 0x7f9181d88790
    [junit]   2/8: 0x7f9181d887d0
    [junit]   3/8: 0x7f9181d6d440
    [junit]   4/8: 0x7f9181d6d480
    [junit]   5/8: 0x7f9181d69370
    [junit]   6/8: 0x7f9181d693b0
    [junit]   7/8: 0x7f9181d693f0
    [junit] Tests run: 1, Failures: 0, Errors: 0, Time elapsed: 0.087 sec
    [junit] ------------- Standard Error -----------------
    [junit] ++++ TestCase.setUp: com.jogamp.gluegen.test.junit.generation.Test1p2LoadJNIAndImplLib - chapter02TestClassExist
    [junit] ++++ TestCase.tearDown: com.jogamp.gluegen.test.junit.generation.Test1p2LoadJNIAndImplLib - chapter02TestClassExist
    [junit] ------------- ---------------- ---------------
    [junit] 
    [junit] Testcase: chapter02TestClassExist took 0.001 sec
    [junit] Tests run: 1, Failures: 0, Errors: 0, Time elapsed: 0.087 sec
    [junit] 
    [junit] ------------- Standard Error -----------------
    [junit] ++++ TestCase.setUp: com.jogamp.gluegen.test.junit.generation.Test1p2LoadJNIAndImplLib - chapter02TestClassExist
    [junit] ++++ TestCase.tearDown: com.jogamp.gluegen.test.junit.generation.Test1p2LoadJNIAndImplLib - chapter02TestClassExist
    [junit] ------------- ---------------- ---------------
    [junit] Testsuite: com.jogamp.gluegen.test.junit.generation.Test1p2ProcAddressEmitter
    [junit] Testsuite: com.jogamp.gluegen.test.junit.generation.Test1p2ProcAddressEmitter
    [junit] Testing accessing PointerBuffer values [0..7]
    [junit]   0/8: 0x7f9181ced680
    [junit]   1/8: 0x7f9181ced680
    [junit]   2/8: 0x7f9181ced680
    [junit]   3/8: 0x7f9181ced680
    [junit]   4/8: 0x7f9181ced680
    [junit]   5/8: 0x7f9181ced680
    [junit]   6/8: 0x7f9181ced680
    [junit]   7/8: 0x7f9181ced680
    [junit] Testing accessing PointerBuffer values [0..7]
    [junit]   0/8: 0x4
    [junit]   1/8: 0x4
    [junit]   2/8: 0x4
    [junit]   3/8: 0x4
    [junit]   4/8: 0x4
    [junit]   5/8: 0x4
    [junit]   6/8: 0x4
    [junit]   7/8: 0x4
    [junit] ++++ TestCase.tearDown: com.jogamp.gluegen.test.junit.generation.Test1p2ProcAddressEmitter - chapter03aTestCoverageFunctionalityDirectNIOAndPrimitiveArray
    [junit] ++++ TestCase.setUp: com.jogamp.gluegen.test.junit.generation.Test1p2ProcAddressEmitter - chapter03bTestCoverageFunctionalityIndirectNIOAndPrimitiveArray
    [junit] Testing accessing PointerBuffer values [0..7]
    [junit]   0/8: 0x7f562ae70
    [junit]   1/8: 0x7f562aeb0
    [junit]   2/8: 0x7f562aef0
    [junit]   3/8: 0x7f562af30
    [junit]   4/8: 0x7f562af70
    [junit]   5/8: 0x7f562afb0
    [junit]   6/8: 0x7f562aff0
    [junit]   7/8: 0x7f562b030
    [junit] Testing accessing PointerBuffer values [0..7]
    [junit]   0/8: 0x7f562ae70
    [junit]   1/8: 0x7f562aeb0
    [junit]   2/8: 0x7f562aef0
    [junit]   3/8: 0x7f562af30
    [junit]   4/8: 0x7f562af70
    [junit]   5/8: 0x7f562afb0
    [junit]   6/8: 0x7f562aff0
    [junit]   7/8: 0x7f562b030
    [junit] Testing accessing PointerBuffer values [0..7]
    [junit]   0/8: 0x7f9181d7b240
    [junit]   1/8: 0x7f9181d7b280
    [junit]   2/8: 0x7f9181d7b2c0
    [junit]   3/8: 0x7f9181d7b300
    [junit]   4/8: 0x7f9181d78480
    [junit]   5/8: 0x7f9181d784c0
    [junit]   6/8: 0x7f9181d78500
    [junit]   7/8: 0x7f9181d78540
    [junit] Testing accessing PointerBuffer values [0..7]
    [junit]   0/8: 0x7f9181d7b240
    [junit]   1/8: 0x7f9181d7b280
    [junit]   2/8: 0x7f9181d7b2c0
    [junit]   3/8: 0x7f9181d7b300
    [junit]   4/8: 0x7f9181d78480
    [junit]   5/8: 0x7f9181d784c0
    [junit]   6/8: 0x7f9181d78500
    [junit]   7/8: 0x7f9181d78540
    [junit] Testing accessing PointerBuffer values [0..7]
    [junit]   0/8: 0x7f9181dbae40
    [junit]   1/8: 0x7f9181dbae80
    [junit]   2/8: 0x7f9181dbaec0
    [junit]   3/8: 0x7f9181dbaf00
    [junit]   4/8: 0x7f918402f9d0
    [junit]   5/8: 0x7f918402fa10
    [junit]   6/8: 0x7f918402fa50
    [junit]   7/8: 0x7f918402fa90
    [junit] Testing accessing PointerBuffer values [0..7]
    [junit]   0/8: 0x7f9184032e90
    [junit]   1/8: 0x7f9184032ed0
    [junit]   2/8: 0x7f9184032f10
    [junit]   3/8: 0x7f9184032f50
    [junit]   4/8: 0x7f9181da10d0
    [junit]   5/8: 0x7f9181da1110
    [junit]   6/8: 0x7f9181da1150
    [junit]   7/8: 0x7f9181da1190
    [junit] Testing accessing PointerBuffer values [0..7]
    [junit]   0/8: 0x7f9184032e90
    [junit]   1/8: 0x7f9184032ed0
    [junit]   2/8: 0x7f9184032f10
    [junit]   3/8: 0x7f9184032f50
    [junit]   4/8: 0x7f9181da10d0
    [junit]   5/8: 0x7f9181da1110
    [junit]   6/8: 0x7f9181da1150
    [junit]   7/8: 0x7f9181da1190
    [junit] Testing accessing PointerBuffer values [0..7]
    [junit]   0/8: 0x7f918402fad0
    [junit]   1/8: 0x7f918402fad0
    [junit]   2/8: 0x7f918402fad0
    [junit]   3/8: 0x7f918402fad0
    [junit]   4/8: 0x7f918402fad0
    [junit]   5/8: 0x7f918402fad0
    [junit]   6/8: 0x7f918402fad0
    [junit]   7/8: 0x7f918402fad0
    [junit] Testing accessing PointerBuffer values [0..7]
    [junit]   0/8: 0x4
    [junit]   1/8: 0x4
    [junit]   2/8: 0x4
    [junit]   3/8: 0x4
    [junit]   4/8: 0x4
    [junit]   5/8: 0x4
    [junit]   6/8: 0x4
    [junit]   7/8: 0x4
    [junit] ++++ TestCase.tearDown: com.jogamp.gluegen.test.junit.generation.Test1p2ProcAddressEmitter - chapter03bTestCoverageFunctionalityIndirectNIOAndPrimitiveArray
    [junit] ++++ TestCase.setUp: com.jogamp.gluegen.test.junit.generation.Test1p2ProcAddressEmitter - chapter04TestPointerBuffer
    [junit] Testing accessing PointerBuffer values [0..0]
    [junit]   0/1: 0xdeadbeef
    [junit] Testing accessing PointerBuffer values [0..0]
    [junit]   0/1: 0xdeadbeef
    [junit] Testing accessing PointerBuffer values [0..0]
    [junit]   0/1: 0xdeadbeef
    [junit] Testing accessing PointerBuffer values [0..0]
    [junit]   0/1: 0xdeadbeef
    [junit] Testing accessing PointerBuffer values [0..0]
    [junit]   0/1: 0xdeadbeef
    [junit] Testing accessing PointerBuffer values [0..0]
    [junit]   0/1: 0xdeadbeef
    [junit] Testing accessing PointerBuffer values [0..0]
    [junit]   0/1: 0xdeadbeef
    [junit] Testing accessing PointerBuffer values [0..0]
    [junit]   0/1: 0xdeadbeef
    [junit] ++++ TestCase.tearDown: com.jogamp.gluegen.test.junit.generation.Test1p2ProcAddressEmitter - chapter04TestPointerBuffer
    [junit] ++++ TestCase.setUp: com.jogamp.gluegen.test.junit.generation.Test1p2ProcAddressEmitter - chapter05TestSomeFunctionsAllIndirect
    [junit] ArrayCopy.01: [1, 2, 3, 4, 5, 6, 7, 8, 9, 0]
    [junit] ArrayCopy.02: [1, 2, 3, 4, 5, 6, 7, 8, 9, 0], java.nio.HeapIntBuffer[pos=0 lim=10 cap=10]
    [junit] ArrayCopy.03: [4, 5, 6, 7]
    [junit] ArrayCopy.04: [0, 0, 0, 4, 5, 6, 7, 0, 0, 0]
    [junit] ArrayCopy.05: [0, 0, 0, 4, 5, 6, 7, 0, 0, 0], java.nio.HeapIntBuffer[pos=0 lim=10 cap=10]
    [junit] ++++ TestCase.tearDown: com.jogamp.gluegen.test.junit.generation.Test1p2ProcAddressEmitter - chapter05TestSomeFunctionsAllIndirect
    [junit] ++++ TestCase.setUp: com.jogamp.gluegen.test.junit.generation.Test1p2ProcAddressEmitter - chapter09TestCompoundAlignment
    [junit] static  md: MachineDescriptionStatic: X86_64_UNIX(2): MachineDescription: runtimeValidated false, littleEndian true, 32Bit false, primitive size / alignment:
    [junit]   int8    1 / 1, int16   2 / 2
    [junit]   int     4 / 4, long    8 / 8
    [junit]   int32   4 / 4, int64   8 / 8
    [junit]   float   4 / 4, double  8 / 8, ldouble 16 / 16
    [junit]   pointer 8 / 8, page    4096
    [junit] runtime md: MachineDescription: runtimeValidated true, littleEndian true, 32Bit false, primitive size / alignment:
    [junit]   int8    1 / 1, int16   2 / 2
    [junit]   int     4 / 4, long    8 / 8
    [junit]   int32   4 / 4, int64   8 / 8
    [junit]   float   4 / 4, double  8 / 8, ldouble 16 / 16
    [junit]   pointer 8 / 8, page    4096
    [junit] compatible static/runtime: true
    [junit] TK_ComplicatedSubSet: sizeof(): 72
    [junit] TK_ComplicatedSubSet: bits1-s offset: 0
    [junit] TK_ComplicatedSubSet:    id-s offset: 4
    [junit] TK_ComplicatedSubSet: bits2-s offset: 8
    [junit] TK_ComplicatedSubSet: long0-s offset: 16
    [junit] TK_ComplicatedSubSet: bits3-s offset: 24
    [junit] TK_ComplicatedSubSet: real0-s offset: 32
    [junit] TK_ComplicatedSubSet: bits4-s offset: 40
    [junit] TK_ComplicatedSubSet: real1-s offset: 44
    [junit] TK_ComplicatedSubSet: bits5-s offset: 48
    [junit] TK_ComplicatedSubSet: longX-s offset: 56
    [junit] TK_ComplicatedSubSet: bits6-s offset: 64
    [junit] TK_ComplicatedSuperSet: sizeof(): 168
    [junit] TK_ComplicatedSuperSet: bits1-s offset: 0
    [junit] TK_ComplicatedSuperSet:  sub1-s offset: 8
    [junit] TK_ComplicatedSuperSet: bits2-s offset: 80
    [junit] TK_ComplicatedSuperSet:  sub2-s offset: 88
    [junit] TK_ComplicatedSuperSet: bits3-s offset: 160
    [junit] createComplicatedSuperSet:
    [junit] TK_ComplicatedSuperSet [
    [junit]   cs.b1         0xA0
    [junit]   cs.sub1.b1    0xA1
    [junit]   cs.sub1.id    0x12345678
    [junit]   cs.sub1.b2    0xA2
    [junit]   cs.sub1.long0 0x123456789ABCDEF0
    [junit]   cs.sub1.b3    0xA3
    [junit]   cs.sub1.real0 3.14159 0X1.921FB54442D18P+1
    [junit]   cs.sub1.b4    0xA4
    [junit]   cs.sub1.real1 256.123 0X1.001F9AP+8
    [junit]   cs.sub1.b5    0xA5
    [junit]   cs.sub1.longX 0xDEADBEEF
    [junit]   cs.sub1.b6    0xA6
    [junit]   cs.b2         0xB0
    [junit]   cs.sub2.b1    0xB1
    [junit]   cs.sub2.id    0x12345678
    [junit]   cs.sub2.b2    0xB2
    [junit]   cs.sub2.long0 0x123456789ABCDEF0
    [junit]   cs.sub2.b3    0xB3
    [junit]   cs.sub2.real0 3.14159 0X1.921FB54442D18P+1
    [junit]   cs.sub2.b4    0xB4
    [junit]   cs.sub2.real1 256.123 0X1.001F9AP+8
    [junit]   cs.sub2.b5    0xB5
    [junit]   cs.sub2.longX 0xDEADBEEF
    [junit]   cs.sub2.b6    0xB6
    [junit]   cs.b3         0xC0
    [junit] ]
    [junit] 
    [junit] hasInitValues res 1:
    [junit] TK_ComplicatedSuperSet [
    [junit]   cs.b1         0xA0
    [junit]   cs.sub1.b1    0xA1
    [junit]   cs.sub1.id    0x12345678
    [junit]   cs.sub1.b2    0xA2
    [junit]   cs.sub1.long0 0x123456789ABCDEF0
    [junit]   cs.sub1.b3    0xA3
    [junit]   cs.sub1.real0 3.14159 0X1.921FB54442D18P+1
    [junit]   cs.sub1.b4    0xA4
    [junit]   cs.sub1.real1 256.123 0X1.001F9AP+8
    [junit]   cs.sub1.b5    0xA5
    [junit]   cs.sub1.longX 0xDEADBEEF
    [junit]   cs.sub1.b6    0xA6
    [junit]   cs.b2         0xB0
    [junit]   cs.sub2.b1    0xB1
    [junit]   cs.sub2.id    0x12345678
    [junit]   cs.sub2.b2    0xB2
    [junit]   cs.sub2.long0 0x123456789ABCDEF0
    [junit]   cs.sub2.b3    0xB3
    [junit]   cs.sub2.real0 3.14159 0X1.921FB54442D18P+1
    [junit]   cs.sub2.b4    0xB4
    [junit]   cs.sub2.real1 256.123 0X1.001F9AP+8
    [junit]   cs.sub2.b5    0xB5
    [junit]   cs.sub2.longX 0xDEADBEEF
    [junit]   cs.sub2.b6    0xB6
    [junit]   cs.b3         0xC0
    [junit] ]
    [junit] 
    [junit] ++++ TestCase.tearDown: com.jogamp.gluegen.test.junit.generation.Test1p2ProcAddressEmitter - chapter09TestCompoundAlignment
    [junit] ++++ TestCase.setUp: com.jogamp.gluegen.test.junit.generation.Test1p2ProcAddressEmitter - chapter10TestCompoundCallByReference
    [junit] 0x123456789abcdef0 == 0x123456789abcdef0
    [junit] 0xa23456781abcdef0 == 0xa23456781abcdef0
    [junit] 0xb23456782abcdef0 == 0xb23456782abcdef0
    [junit] 0x123456789abcdef0 == 0x123456789abcdef0
    [junit] 0xa23456781abcdef0 == 0xa23456781abcdef0
    [junit] 0xb23456782abcdef0 == 0xb23456782abcdef0
    [junit] 0x123456789abcdef0 == 0x123456789abcdef0
    [junit] 0xa23456781abcdef0 == 0xa23456781abcdef0
    [junit] 0xb23456782abcdef0 == 0xb23456782abcdef0
    [junit] 0x123456789abcdef0 == 0x123456789abcdef0
    [junit] 0xa23456781abcdef0 == 0xa23456781abcdef0
    [junit] 0xb23456782abcdef0 == 0xb23456782abcdef0
    [junit] ch10: ref-dim 286331153/572662306 858993459x1145324612
    [junit] ++++ TestCase.tearDown: com.jogamp.gluegen.test.junit.generation.Test1p2ProcAddressEmitter - chapter10TestCompoundCallByReference
    [junit] ++++ TestCase.setUp: com.jogamp.gluegen.test.junit.generation.Test1p2ProcAddressEmitter - chapter11TestCompoundCallByValue
    [junit] ch11.0: ref-dim 286331153/572662306 858993459x1145324612
    [junit] XXX.getSurfaceBoundsValue: dim 286331153/572662306 858993459x1145324612
    [junit] ch11.0: val-dim 286331153/572662306 858993459x1145324612
    [junit] ch11.1: val-dim 11/22 33x44
    [junit] XXX.getSurfaceBoundsValue: dim 11/22 33x44
    [junit] ch11.2: val-dim 11/22 33x44
    [junit] ch11.3: sameInstanceByVal false
    [junit] ch11.3: sameInstanceByRef false
    [junit] ch11.4: sum-dimArray 12/24 36x48
    [junit] ch11.5: dimsGet[0] 11/22 33x44
    [junit] ch11.5: dimsGet[1] 1/2 3x4
    [junit] ch11.6: sum-dimPair 12/24 36x48
    [junit] ch11.7: zero-dim[0] 0/0 0x0
    [junit] ch11.7: zero-dim[1] 0/0 0x0
    [junit] ch11.8: copyPrim2Dim 11/22 100x200
    [junit] ch11.9: copyDim2Prim 11/22 100x200
    [junit] ch11.10: expRGBAb 0x11, 0x22, 0x33, 0xffffffaa
    [junit] ch11.10: hasRGBAi 0x112233aa
    [junit] ch11.11: hasRGBAb 0x11, 0x22, 0x33, 0xffffffaa
    [junit] ch11.12: addInt 3
    [junit] ch11.13: addByte 3
    [junit] ++++ TestCase.tearDown: com.jogamp.gluegen.test.junit.generation.Test1p2ProcAddressEmitter - chapter11TestCompoundCallByValue
    [junit] ++++ TestCase.setUp: com.jogamp.gluegen.test.junit.generation.Test1p2ProcAddressEmitter - chapter12TestStructArrayModelConst
    [junit] 0x123456789abcdef0 == 0x123456789abcdef0
    [junit] 0x123456789abcdef0 == 0x123456789abcdef0
    [junit] has 'Hello Array'
    [junit] has   0: 0x48 H
    [junit] has   1: 0x65 e
    [junit] has   2: 0x6C l
    [junit] has   3: 0x6C l
    [junit] has   4: 0x6F o
    [junit] has   5: 0x20  
    [junit] has   6: 0x41 A
    [junit] has   7: 0x72 r
    [junit] has   8: 0x72 r
    [junit] has   9: 0x61 a
    [junit] has  10: 0x79 y
    [junit] has 'Hello CString'
    [junit] has   0: 0x48 H
    [junit] has   1: 0x65 e
    [junit] has   2: 0x6C l
    [junit] has   3: 0x6C l
    [junit] has   4: 0x6F o
    [junit] has   5: 0x20  
    [junit] has   6: 0x43 C
    [junit] has   7: 0x53 S
    [junit] has   8: 0x74 t
    [junit] has   9: 0x72 r
    [junit] has  10: 0x69 i
    [junit] has  11: 0x6E n
    [junit] has  12: 0x67 g
    [junit] has 'Hello Pointer'
    [junit] has   0: 0x48 H
    [junit] has   1: 0x65 e
    [junit] has   2: 0x6C l
    [junit] has   3: 0x6C l
    [junit] has   4: 0x6F o
    [junit] has   5: 0x20  
    [junit] has   6: 0x50 P
    [junit] has   7: 0x6F o
    [junit] has   8: 0x69 i
    [junit] has   9: 0x6E n
    [junit] has  10: 0x74 t
    [junit] has  11: 0x65 e
    [junit] has  12: 0x72 r
    [junit] ++++ TestCase.tearDown: com.jogamp.gluegen.test.junit.generation.Test1p2ProcAddressEmitter - chapter12TestStructArrayModelConst
    [junit] ++++ TestCase.setUp: com.jogamp.gluegen.test.junit.generation.Test1p2ProcAddressEmitter - chapter13TestStructArrayModelMutable
    [junit] 0x123456789abcdef0 == 0x123456789abcdef0
    [junit] 0x123456789abcdef0 == 0x123456789abcdef0
    [junit] ++++ TestCase.tearDown: com.jogamp.gluegen.test.junit.generation.Test1p2ProcAddressEmitter - chapter13TestStructArrayModelMutable
    [junit] Tests run: 10, Failures: 0, Errors: 0, Time elapsed: 0.202 sec
    [junit] ------------- Standard Error -----------------
    [junit] ++++ TestCase.setUp: com.jogamp.gluegen.test.junit.generation.Test1p2ProcAddressEmitter - chapter02TestClassExist
    [junit] ++++ TestCase.tearDown: com.jogamp.gluegen.test.junit.generation.Test1p2ProcAddressEmitter - chapter02TestClassExist
    [junit] ++++ TestCase.setUp: com.jogamp.gluegen.test.junit.generation.Test1p2ProcAddressEmitter - chapter03aTestCoverageFunctionalityDirectNIOAndPrimitiveArray
    [junit] Testing accessing PointerBuffer values [0..7]
    [junit]   0/8: 0x7f9181d81d30
    [junit]   1/8: 0x7f9181d81d70
    [junit]   2/8: 0x7f9181d81db0
    [junit]   3/8: 0x7f9181d81df0
    [junit]   4/8: 0x7f9181d81e30
    [junit]   5/8: 0x7f9181d81e70
    [junit]   6/8: 0x7f9181d81eb0
    [junit]   7/8: 0x7f9181d81ef0
    [junit] Testing accessing PointerBuffer values [0..7]
    [junit]   0/8: 0x7f9181d81d30
    [junit]   1/8: 0x7f9181d81d70
    [junit]   2/8: 0x7f9181d81db0
    [junit]   3/8: 0x7f9181d81df0
    [junit]   4/8: 0x7f9181d81e30
    [junit]   5/8: 0x7f9181d81e70
    [junit]   6/8: 0x7f9181d81eb0
    [junit]   7/8: 0x7f9181d81ef0
    [junit] Testing accessing PointerBuffer values [0..7]
    [junit]   0/8: 0x7f9181deffd0
    [junit]   1/8: 0x7f9181df0010
    [junit]   2/8: 0x7f9181df0050
    [junit]   3/8: 0x7f9181df0090
    [junit]   4/8: 0x7f9181dc8b60
    [junit]   5/8: 0x7f9181dc8ba0
    [junit]   6/8: 0x7f9181dc8be0
    [junit]   7/8: 0x7f9181dc8c20
    [junit] Testing accessing PointerBuffer values [0..7]
    [junit]   0/8: 0x7f9181deffd0
    [junit]   1/8: 0x7f9181df0010
    [junit]   2/8: 0x7f9181df0050
    [junit]   3/8: 0x7f9181df0090
    [junit]   4/8: 0x7f9181dc8b60
    [junit]   5/8: 0x7f9181dc8ba0
    [junit]   6/8: 0x7f9181dc8be0
    [junit]   7/8: 0x7f9181dc8c20
    [junit] Testing accessing PointerBuffer values [0..7]
    [junit]   0/8: 0x7f9181d6ebf0
    [junit]   1/8: 0x7f9181d6ec30
    [junit]   2/8: 0x7f9181d6ec70
    [junit]   3/8: 0x7f9181de9d60
    [junit]   4/8: 0x7f9181de9da0
    [junit]   5/8: 0x7f9181de9de0
    [junit]   6/8: 0x7f9181de9e20
    [junit]   7/8: 0x7f9181d88710
    [junit] Testing accessing PointerBuffer values [0..7]
    [junit]   0/8: 0x7f9184013c70
    [junit]   1/8: 0x7f9181d88790
    [junit]   2/8: 0x7f9181d887d0
    [junit]   3/8: 0x7f9181d6d440
    [junit]   4/8: 0x7f9181d6d480
    [junit]   5/8: 0x7f9181d69370
    [junit]   6/8: 0x7f9181d693b0
    [junit]   7/8: 0x7f9181d693f0
    [junit] Testing accessing PointerBuffer values [0..7]
    [junit]   0/8: 0x7f9184013c70
    [junit]   1/8: 0x7f9181d88790
    [junit]   2/8: 0x7f9181d887d0
    [junit]   3/8: 0x7f9181d6d440
    [junit]   4/8: 0x7f9181d6d480
    [junit]   5/8: 0x7f9181d69370
    [junit]   6/8: 0x7f9181d693b0
    [junit]   7/8: 0x7f9181d693f0
    [junit] Testing accessing PointerBuffer values [0..7]
    [junit]   0/8: 0x7f9181ced680
    [junit]   1/8: 0x7f9181ced680
    [junit]   2/8: 0x7f9181ced680
    [junit]   3/8: 0x7f9181ced680
    [junit]   4/8: 0x7f9181ced680
    [junit]   5/8: 0x7f9181ced680
    [junit]   6/8: 0x7f9181ced680
    [junit]   7/8: 0x7f9181ced680
    [junit] Testing accessing PointerBuffer values [0..7]
    [junit]   0/8: 0x4
    [junit]   1/8: 0x4
    [junit]   2/8: 0x4
    [junit]   3/8: 0x4
    [junit]   4/8: 0x4
    [junit]   5/8: 0x4
    [junit]   6/8: 0x4
    [junit]   7/8: 0x4
    [junit] ++++ TestCase.tearDown: com.jogamp.gluegen.test.junit.generation.Test1p2ProcAddressEmitter - chapter03aTestCoverageFunctionalityDirectNIOAndPrimitiveArray
    [junit] ++++ TestCase.setUp: com.jogamp.gluegen.test.junit.generation.Test1p2ProcAddressEmitter - chapter03bTestCoverageFunctionalityIndirectNIOAndPrimitiveArray
    [junit] Testing accessing PointerBuffer values [0..7]
    [junit]   0/8: 0x7f562ae70
    [junit]   1/8: 0x7f562aeb0
    [junit]   2/8: 0x7f562aef0
    [junit]   3/8: 0x7f562af30
    [junit]   4/8: 0x7f562af70
    [junit]   5/8: 0x7f562afb0
    [junit]   6/8: 0x7f562aff0
    [junit]   7/8: 0x7f562b030
    [junit] Testing accessing PointerBuffer values [0..7]
    [junit]   0/8: 0x7f562ae70
    [junit]   1/8: 0x7f562aeb0
    [junit]   2/8: 0x7f562aef0
    [junit]   3/8: 0x7f562af30
    [junit]   4/8: 0x7f562af70
    [junit]   5/8: 0x7f562afb0
    [junit]   6/8: 0x7f562aff0
    [junit]   7/8: 0x7f562b030
    [junit] Testing accessing PointerBuffer values [0..7]
    [junit]   0/8: 0x7f9181d7b240
    [junit]   1/8: 0x7f9181d7b280
    [junit]   2/8: 0x7f9181d7b2c0
    [junit]   3/8: 0x7f9181d7b300
    [junit]   4/8: 0x7f9181d78480
    [junit]   5/8: 0x7f9181d784c0
    [junit]   6/8: 0x7f9181d78500
    [junit]   7/8: 0x7f9181d78540
    [junit] Testing accessing PointerBuffer values [0..7]
    [junit]   0/8: 0x7f9181d7b240
    [junit]   1/8: 0x7f9181d7b280
    [junit]   2/8: 0x7f9181d7b2c0
    [junit]   3/8: 0x7f9181d7b300
    [junit]   4/8: 0x7f9181d78480
    [junit]   5/8: 0x7f9181d784c0
    [junit]   6/8: 0x7f9181d78500
    [junit]   7/8: 0x7f9181d78540
    [junit] Testing accessing PointerBuffer values [0..7]
    [junit]   0/8: 0x7f9181dbae40
    [junit]   1/8: 0x7f9181dbae80
    [junit]   2/8: 0x7f9181dbaec0
    [junit]   3/8: 0x7f9181dbaf00
    [junit]   4/8: 0x7f918402f9d0
    [junit]   5/8: 0x7f918402fa10
    [junit]   6/8: 0x7f918402fa50
    [junit]   7/8: 0x7f918402fa90
    [junit] Testing accessing PointerBuffer values [0..7]
    [junit]   0/8: 0x7f9184032e90
    [junit]   1/8: 0x7f9184032ed0
    [junit]   2/8: 0x7f9184032f10
    [junit]   3/8: 0x7f9184032f50
    [junit]   4/8: 0x7f9181da10d0
    [junit]   5/8: 0x7f9181da1110
    [junit]   6/8: 0x7f9181da1150
    [junit]   7/8: 0x7f9181da1190
    [junit] Testing accessing PointerBuffer values [0..7]
    [junit]   0/8: 0x7f9184032e90
    [junit]   1/8: 0x7f9184032ed0
    [junit]   2/8: 0x7f9184032f10
    [junit]   3/8: 0x7f9184032f50
    [junit]   4/8: 0x7f9181da10d0
    [junit]   5/8: 0x7f9181da1110
    [junit]   6/8: 0x7f9181da1150
    [junit]   7/8: 0x7f9181da1190
    [junit] Testing accessing PointerBuffer values [0..7]
    [junit]   0/8: 0x7f918402fad0
    [junit]   1/8: 0x7f918402fad0
    [junit]   2/8: 0x7f918402fad0
    [junit]   3/8: 0x7f918402fad0
    [junit]   4/8: 0x7f918402fad0
    [junit]   5/8: 0x7f918402fad0
    [junit]   6/8: 0x7f918402fad0
    [junit]   7/8: 0x7f918402fad0
    [junit] Testing accessing PointerBuffer values [0..7]
    [junit]   0/8: 0x4
    [junit]   1/8: 0x4
    [junit]   2/8: 0x4
    [junit]   3/8: 0x4
    [junit]   4/8: 0x4
    [junit]   5/8: 0x4
    [junit]   6/8: 0x4
    [junit]   7/8: 0x4
    [junit] ++++ TestCase.tearDown: com.jogamp.gluegen.test.junit.generation.Test1p2ProcAddressEmitter - chapter03bTestCoverageFunctionalityIndirectNIOAndPrimitiveArray
    [junit] ++++ TestCase.setUp: com.jogamp.gluegen.test.junit.generation.Test1p2ProcAddressEmitter - chapter04TestPointerBuffer
    [junit] Testing accessing PointerBuffer values [0..0]
    [junit]   0/1: 0xdeadbeef
    [junit] Testing accessing PointerBuffer values [0..0]
    [junit]   0/1: 0xdeadbeef
    [junit] Testing accessing PointerBuffer values [0..0]
    [junit]   0/1: 0xdeadbeef
    [junit] Testing accessing PointerBuffer values [0..0]
    [junit]   0/1: 0xdeadbeef
    [junit] Testing accessing PointerBuffer values [0..0]
    [junit]   0/1: 0xdeadbeef
    [junit] Testing accessing PointerBuffer values [0..0]
    [junit]   0/1: 0xdeadbeef
    [junit] Testing accessing PointerBuffer values [0..0]
    [junit]   0/1: 0xdeadbeef
    [junit] Testing accessing PointerBuffer values [0..0]
    [junit]   0/1: 0xdeadbeef
    [junit] ++++ TestCase.tearDown: com.jogamp.gluegen.test.junit.generation.Test1p2ProcAddressEmitter - chapter04TestPointerBuffer
    [junit] ++++ TestCase.setUp: com.jogamp.gluegen.test.junit.generation.Test1p2ProcAddressEmitter - chapter05TestSomeFunctionsAllIndirect
    [junit] ArrayCopy.01: [1, 2, 3, 4, 5, 6, 7, 8, 9, 0]
    [junit] ArrayCopy.02: [1, 2, 3, 4, 5, 6, 7, 8, 9, 0], java.nio.HeapIntBuffer[pos=0 lim=10 cap=10]
    [junit] ArrayCopy.03: [4, 5, 6, 7]
    [junit] ArrayCopy.04: [0, 0, 0, 4, 5, 6, 7, 0, 0, 0]
    [junit] ArrayCopy.05: [0, 0, 0, 4, 5, 6, 7, 0, 0, 0], java.nio.HeapIntBuffer[pos=0 lim=10 cap=10]
    [junit] ++++ TestCase.tearDown: com.jogamp.gluegen.test.junit.generation.Test1p2ProcAddressEmitter - chapter05TestSomeFunctionsAllIndirect
    [junit] ++++ TestCase.setUp: com.jogamp.gluegen.test.junit.generation.Test1p2ProcAddressEmitter - chapter09TestCompoundAlignment
    [junit] static  md: MachineDescriptionStatic: X86_64_UNIX(2): MachineDescription: runtimeValidated false, littleEndian true, 32Bit false, primitive size / alignment:
    [junit]   int8    1 / 1, int16   2 / 2
    [junit]   int     4 / 4, long    8 / 8
    [junit]   int32   4 / 4, int64   8 / 8
    [junit]   float   4 / 4, double  8 / 8, ldouble 16 / 16
    [junit]   pointer 8 / 8, page    4096
    [junit] runtime md: MachineDescription: runtimeValidated true, littleEndian true, 32Bit false, primitive size / alignment:
    [junit]   int8    1 / 1, int16   2 / 2
    [junit]   int     4 / 4, long    8 / 8
    [junit]   int32   4 / 4, int64   8 / 8
    [junit]   float   4 / 4, double  8 / 8, ldouble 16 / 16
    [junit]   pointer 8 / 8, page    4096
    [junit] compatible static/runtime: true
    [junit] ++++ TestCase.tearDown: com.jogamp.gluegen.test.junit.generation.Test1p2ProcAddressEmitter - chapter09TestCompoundAlignment
    [junit] ++++ TestCase.setUp: com.jogamp.gluegen.test.junit.generation.Test1p2ProcAddressEmitter - chapter10TestCompoundCallByReference
    [junit] 0x123456789abcdef0 == 0x123456789abcdef0
    [junit] 0xa23456781abcdef0 == 0xa23456781abcdef0
    [junit] 0xb23456782abcdef0 == 0xb23456782abcdef0
    [junit] 0x123456789abcdef0 == 0x123456789abcdef0
    [junit] 0xa23456781abcdef0 == 0xa23456781abcdef0
    [junit] 0xb23456782abcdef0 == 0xb23456782abcdef0
    [junit] 0x123456789abcdef0 == 0x123456789abcdef0
    [junit] 0xa23456781abcdef0 == 0xa23456781abcdef0
    [junit] 0xb23456782abcdef0 == 0xb23456782abcdef0
    [junit] 0x123456789abcdef0 == 0x123456789abcdef0
    [junit] 0xa23456781abcdef0 == 0xa23456781abcdef0
    [junit] 0xb23456782abcdef0 == 0xb23456782abcdef0
    [junit] ch10: ref-dim 286331153/572662306 858993459x1145324612
    [junit] ++++ TestCase.tearDown: com.jogamp.gluegen.test.junit.generation.Test1p2ProcAddressEmitter - chapter10TestCompoundCallByReference
    [junit] ++++ TestCase.setUp: com.jogamp.gluegen.test.junit.generation.Test1p2ProcAddressEmitter - chapter11TestCompoundCallByValue
    [junit] ch11.0: ref-dim 286331153/572662306 858993459x1145324612
    [junit] ch11.0: val-dim 286331153/572662306 858993459x1145324612
    [junit] ch11.1: val-dim 11/22 33x44
    [junit] ch11.2: val-dim 11/22 33x44
    [junit] ch11.3: sameInstanceByVal false
    [junit] ch11.3: sameInstanceByRef false
    [junit] ch11.4: sum-dimArray 12/24 36x48
    [junit] ch11.5: dimsGet[0] 11/22 33x44
    [junit] ch11.5: dimsGet[1] 1/2 3x4
    [junit] ch11.6: sum-dimPair 12/24 36x48
    [junit] ch11.7: zero-dim[0] 0/0 0x0
    [junit] ch11.7: zero-dim[1] 0/0 0x0
    [junit] ch11.8: copyPrim2Dim 11/22 100x200
    [junit] ch11.9: copyDim2Prim 11/22 100x200
    [junit] ch11.10: expRGBAb 0x11, 0x22, 0x33, 0xffffffaa
    [junit] ch11.10: hasRGBAi 0x112233aa
    [junit] ch11.11: hasRGBAb 0x11, 0x22, 0x33, 0xffffffaa
    [junit] ch11.12: addInt 3
    [junit] ch11.13: addByte 3
    [junit] ++++ TestCase.tearDown: com.jogamp.gluegen.test.junit.generation.Test1p2ProcAddressEmitter - chapter11TestCompoundCallByValue
    [junit] ++++ TestCase.setUp: com.jogamp.gluegen.test.junit.generation.Test1p2ProcAddressEmitter - chapter12TestStructArrayModelConst
    [junit] 0x123456789abcdef0 == 0x123456789abcdef0
    [junit] 0x123456789abcdef0 == 0x123456789abcdef0
    [junit] has 'Hello Array'
    [junit] has   0: 0x48 H
    [junit] has   1: 0x65 e
    [junit] has   2: 0x6C l
    [junit] has   3: 0x6C l
    [junit] has   4: 0x6F o
    [junit] has   5: 0x20  
    [junit] has   6: 0x41 A
    [junit] has   7: 0x72 r
    [junit] has   8: 0x72 r
    [junit] has   9: 0x61 a
    [junit] has  10: 0x79 y
    [junit] has 'Hello CString'
    [junit] has   0: 0x48 H
    [junit] has   1: 0x65 e
    [junit] has   2: 0x6C l
    [junit] has   3: 0x6C l
    [junit] has   4: 0x6F o
    [junit] has   5: 0x20  
    [junit] has   6: 0x43 C
    [junit] has   7: 0x53 S
    [junit] has   8: 0x74 t
    [junit] has   9: 0x72 r
    [junit] has  10: 0x69 i
    [junit] has  11: 0x6E n
    [junit] has  12: 0x67 g
    [junit] has 'Hello Pointer'
    [junit] has   0: 0x48 H
    [junit] has   1: 0x65 e
    [junit] has   2: 0x6C l
    [junit] has   3: 0x6C l
    [junit] has   4: 0x6F o
    [junit] has   5: 0x20  
    [junit] has   6: 0x50 P
    [junit] has   7: 0x6F o
    [junit] has   8: 0x69 i
    [junit] has   9: 0x6E n
    [junit] has  10: 0x74 t
    [junit] has  11: 0x65 e
    [junit] has  12: 0x72 r
    [junit] ++++ TestCase.tearDown: com.jogamp.gluegen.test.junit.generation.Test1p2ProcAddressEmitter - chapter12TestStructArrayModelConst
    [junit] ++++ TestCase.setUp: com.jogamp.gluegen.test.junit.generation.Test1p2ProcAddressEmitter - chapter13TestStructArrayModelMutable
    [junit] 0x123456789abcdef0 == 0x123456789abcdef0
    [junit] 0x123456789abcdef0 == 0x123456789abcdef0
    [junit] ++++ TestCase.tearDown: com.jogamp.gluegen.test.junit.generation.Test1p2ProcAddressEmitter - chapter13TestStructArrayModelMutable
    [junit] ------------- ---------------- ---------------
    [junit] 
    [junit] Testcase: chapter02TestClassExist took 0 sec
    [junit] Testcase: chapter03aTestCoverageFunctionalityDirectNIOAndPrimitiveArray took 0.035 sec
    [junit] Testcase: chapter03bTestCoverageFunctionalityIndirectNIOAndPrimitiveArray took 0.021 sec
    [junit] Testcase: chapter04TestPointerBuffer took 0.027 sec
    [junit] Testcase: chapter05TestSomeFunctionsAllIndirect took 0 sec
    [junit] Testcase: chapter09TestCompoundAlignment took 0.002 sec
    [junit] Testcase: chapter10TestCompoundCallByReference took 0.001 sec
    [junit] Testcase: chapter11TestCompoundCallByValue took 0.009 sec
    [junit] Testcase: chapter12TestStructArrayModelConst took 0.005 sec
    [junit] Testcase: chapter13TestStructArrayModelMutable took 0.003 sec
    [junit] Tests run: 10, Failures: 0, Errors: 0, Time elapsed: 0.202 sec
    [junit] 
    [junit] ------------- Standard Error -----------------
    [junit] ++++ TestCase.setUp: com.jogamp.gluegen.test.junit.generation.Test1p2ProcAddressEmitter - chapter02TestClassExist
    [junit] ++++ TestCase.tearDown: com.jogamp.gluegen.test.junit.generation.Test1p2ProcAddressEmitter - chapter02TestClassExist
    [junit] ++++ TestCase.setUp: com.jogamp.gluegen.test.junit.generation.Test1p2ProcAddressEmitter - chapter03aTestCoverageFunctionalityDirectNIOAndPrimitiveArray
    [junit] Testing accessing PointerBuffer values [0..7]
    [junit]   0/8: 0x7f9181d81d30
    [junit]   1/8: 0x7f9181d81d70
    [junit]   2/8: 0x7f9181d81db0
    [junit]   3/8: 0x7f9181d81df0
    [junit]   4/8: 0x7f9181d81e30
    [junit]   5/8: 0x7f9181d81e70
    [junit]   6/8: 0x7f9181d81eb0
    [junit]   7/8: 0x7f9181d81ef0
    [junit] Testing accessing PointerBuffer values [0..7]
    [junit]   0/8: 0x7f9181d81d30
    [junit]   1/8: 0x7f9181d81d70
    [junit]   2/8: 0x7f9181d81db0
    [junit]   3/8: 0x7f9181d81df0
    [junit]   4/8: 0x7f9181d81e30
    [junit]   5/8: 0x7f9181d81e70
    [junit]   6/8: 0x7f9181d81eb0
    [junit]   7/8: 0x7f9181d81ef0
    [junit] Testing accessing PointerBuffer values [0..7]
    [junit]   0/8: 0x7f9181deffd0
    [junit]   1/8: 0x7f9181df0010
    [junit]   2/8: 0x7f9181df0050
    [junit]   3/8: 0x7f9181df0090
    [junit]   4/8: 0x7f9181dc8b60
    [junit]   5/8: 0x7f9181dc8ba0
    [junit]   6/8: 0x7f9181dc8be0
    [junit]   7/8: 0x7f9181dc8c20
    [junit] Testing accessing PointerBuffer values [0..7]
    [junit]   0/8: 0x7f9181deffd0
    [junit]   1/8: 0x7f9181df0010
    [junit]   2/8: 0x7f9181df0050
    [junit]   3/8: 0x7f9181df0090
    [junit]   4/8: 0x7f9181dc8b60
    [junit]   5/8: 0x7f9181dc8ba0
    [junit]   6/8: 0x7f9181dc8be0
    [junit]   7/8: 0x7f9181dc8c20
    [junit] Testing accessing PointerBuffer values [0..7]
    [junit]   0/8: 0x7f9181d6ebf0
    [junit]   1/8: 0x7f9181d6ec30
    [junit]   2/8: 0x7f9181d6ec70
    [junit]   3/8: 0x7f9181de9d60
    [junit]   4/8: 0x7f9181de9da0
    [junit]   5/8: 0x7f9181de9de0
    [junit]   6/8: 0x7f9181de9e20
    [junit]   7/8: 0x7f9181d88710
    [junit] Testing accessing PointerBuffer values [0..7]
    [junit]   0/8: 0x7f9184013c70
    [junit]   1/8: 0x7f9181d88790
    [junit]   2/8: 0x7f9181d887d0
    [junit]   3/8: 0x7f9181d6d440
    [junit]   4/8: 0x7f9181d6d480
    [junit]   5/8: 0x7f9181d69370
    [junit]   6/8: 0x7f9181d693b0
    [junit]   7/8: 0x7f9181d693f0
    [junit] Testing accessing PointerBuffer values [0..7]
    [junit]   0/8: 0x7f9184013c70
    [junit]   1/8: 0x7f9181d88790
    [junit]   2/8: 0x7f9181d887d0
    [junit]   3/8: 0x7f9181d6d440
    [junit]   4/8: 0x7f9181d6d480
    [junit]   5/8: 0x7f9181d69370
    [junit]   6/8: 0x7f9181d693b0
    [junit]   7/8: 0x7f9181d693f0
    [junit] Testing accessing PointerBuffer values [0..7]
    [junit]   0/8: 0x7f9181ced680
    [junit]   1/8: 0x7f9181ced680
    [junit]   2/8: 0x7f9181ced680
    [junit]   3/8: 0x7f9181ced680
    [junit]   4/8: 0x7f9181ced680
    [junit]   5/8: 0x7f9181ced680
    [junit]   6/8: 0x7f9181ced680
    [junit]   7/8: 0x7f9181ced680
    [junit] Testing accessing PointerBuffer values [0..7]
    [junit]   0/8: 0x4
    [junit]   1/8: 0x4
    [junit]   2/8: 0x4
    [junit]   3/8: 0x4
    [junit]   4/8: 0x4
    [junit]   5/8: 0x4
    [junit]   6/8: 0x4
    [junit]   7/8: 0x4
    [junit] ++++ TestCase.tearDown: com.jogamp.gluegen.test.junit.generation.Test1p2ProcAddressEmitter - chapter03aTestCoverageFunctionalityDirectNIOAndPrimitiveArray
    [junit] ++++ TestCase.setUp: com.jogamp.gluegen.test.junit.generation.Test1p2ProcAddressEmitter - chapter03bTestCoverageFunctionalityIndirectNIOAndPrimitiveArray
    [junit] Testing accessing PointerBuffer values [0..7]
    [junit]   0/8: 0x7f562ae70
    [junit]   1/8: 0x7f562aeb0
    [junit]   2/8: 0x7f562aef0
    [junit]   3/8: 0x7f562af30
    [junit]   4/8: 0x7f562af70
    [junit]   5/8: 0x7f562afb0
    [junit]   6/8: 0x7f562aff0
    [junit]   7/8: 0x7f562b030
    [junit] Testing accessing PointerBuffer values [0..7]
    [junit]   0/8: 0x7f562ae70
    [junit]   1/8: 0x7f562aeb0
    [junit]   2/8: 0x7f562aef0
    [junit]   3/8: 0x7f562af30
    [junit]   4/8: 0x7f562af70
    [junit]   5/8: 0x7f562afb0
    [junit]   6/8: 0x7f562aff0
    [junit]   7/8: 0x7f562b030
    [junit] Testing accessing PointerBuffer values [0..7]
    [junit]   0/8: 0x7f9181d7b240
    [junit]   1/8: 0x7f9181d7b280
    [junit]   2/8: 0x7f9181d7b2c0
    [junit]   3/8: 0x7f9181d7b300
    [junit]   4/8: 0x7f9181d78480
    [junit]   5/8: 0x7f9181d784c0
    [junit]   6/8: 0x7f9181d78500
    [junit]   7/8: 0x7f9181d78540
    [junit] Testing accessing PointerBuffer values [0..7]
    [junit]   0/8: 0x7f9181d7b240
    [junit]   1/8: 0x7f9181d7b280
    [junit]   2/8: 0x7f9181d7b2c0
    [junit]   3/8: 0x7f9181d7b300
    [junit]   4/8: 0x7f9181d78480
    [junit]   5/8: 0x7f9181d784c0
    [junit]   6/8: 0x7f9181d78500
    [junit]   7/8: 0x7f9181d78540
    [junit] Testing accessing PointerBuffer values [0..7]
    [junit]   0/8: 0x7f9181dbae40
    [junit]   1/8: 0x7f9181dbae80
    [junit]   2/8: 0x7f9181dbaec0
    [junit]   3/8: 0x7f9181dbaf00
    [junit]   4/8: 0x7f918402f9d0
    [junit]   5/8: 0x7f918402fa10
    [junit]   6/8: 0x7f918402fa50
    [junit]   7/8: 0x7f918402fa90
    [junit] Testing accessing PointerBuffer values [0..7]
    [junit]   0/8: 0x7f9184032e90
    [junit]   1/8: 0x7f9184032ed0
    [junit]   2/8: 0x7f9184032f10
    [junit]   3/8: 0x7f9184032f50
    [junit]   4/8: 0x7f9181da10d0
    [junit]   5/8: 0x7f9181da1110
    [junit]   6/8: 0x7f9181da1150
    [junit]   7/8: 0x7f9181da1190
    [junit] Testing accessing PointerBuffer values [0..7]
    [junit]   0/8: 0x7f9184032e90
    [junit]   1/8: 0x7f9184032ed0
    [junit]   2/8: 0x7f9184032f10
    [junit]   3/8: 0x7f9184032f50
    [junit]   4/8: 0x7f9181da10d0
    [junit]   5/8: 0x7f9181da1110
    [junit]   6/8: 0x7f9181da1150
    [junit]   7/8: 0x7f9181da1190
    [junit] Testing accessing PointerBuffer values [0..7]
    [junit]   0/8: 0x7f918402fad0
    [junit]   1/8: 0x7f918402fad0
    [junit]   2/8: 0x7f918402fad0
    [junit]   3/8: 0x7f918402fad0
    [junit]   4/8: 0x7f918402fad0
    [junit]   5/8: 0x7f918402fad0
    [junit]   6/8: 0x7f918402fad0
    [junit]   7/8: 0x7f918402fad0
    [junit] Testing accessing PointerBuffer values [0..7]
    [junit]   0/8: 0x4
    [junit]   1/8: 0x4
    [junit]   2/8: 0x4
    [junit]   3/8: 0x4
    [junit]   4/8: 0x4
    [junit]   5/8: 0x4
    [junit]   6/8: 0x4
    [junit]   7/8: 0x4
    [junit] ++++ TestCase.tearDown: com.jogamp.gluegen.test.junit.generation.Test1p2ProcAddressEmitter - chapter03bTestCoverageFunctionalityIndirectNIOAndPrimitiveArray
    [junit] ++++ TestCase.setUp: com.jogamp.gluegen.test.junit.generation.Test1p2ProcAddressEmitter - chapter04TestPointerBuffer
    [junit] Testing accessing PointerBuffer values [0..0]
    [junit]   0/1: 0xdeadbeef
    [junit] Testing accessing PointerBuffer values [0..0]
    [junit]   0/1: 0xdeadbeef
    [junit] Testing accessing PointerBuffer values [0..0]
    [junit]   0/1: 0xdeadbeef
    [junit] Testing accessing PointerBuffer values [0..0]
    [junit]   0/1: 0xdeadbeef
    [junit] Testing accessing PointerBuffer values [0..0]
    [junit]   0/1: 0xdeadbeef
    [junit] Testing accessing PointerBuffer values [0..0]
    [junit]   0/1: 0xdeadbeef
    [junit] Testing accessing PointerBuffer values [0..0]
    [junit]   0/1: 0xdeadbeef
    [junit] Testing accessing PointerBuffer values [0..0]
    [junit]   0/1: 0xdeadbeef
    [junit] ++++ TestCase.tearDown: com.jogamp.gluegen.test.junit.generation.Test1p2ProcAddressEmitter - chapter04TestPointerBuffer
    [junit] ++++ TestCase.setUp: com.jogamp.gluegen.test.junit.generation.Test1p2ProcAddressEmitter - chapter05TestSomeFunctionsAllIndirect
    [junit] ArrayCopy.01: [1, 2, 3, 4, 5, 6, 7, 8, 9, 0]
    [junit] ArrayCopy.02: [1, 2, 3, 4, 5, 6, 7, 8, 9, 0], java.nio.HeapIntBuffer[pos=0 lim=10 cap=10]
    [junit] ArrayCopy.03: [4, 5, 6, 7]
    [junit] ArrayCopy.04: [0, 0, 0, 4, 5, 6, 7, 0, 0, 0]
    [junit] ArrayCopy.05: [0, 0, 0, 4, 5, 6, 7, 0, 0, 0], java.nio.HeapIntBuffer[pos=0 lim=10 cap=10]
    [junit] ++++ TestCase.tearDown: com.jogamp.gluegen.test.junit.generation.Test1p2ProcAddressEmitter - chapter05TestSomeFunctionsAllIndirect
    [junit] ++++ TestCase.setUp: com.jogamp.gluegen.test.junit.generation.Test1p2ProcAddressEmitter - chapter09TestCompoundAlignment
    [junit] static  md: MachineDescriptionStatic: X86_64_UNIX(2): MachineDescription: runtimeValidated false, littleEndian true, 32Bit false, primitive size / alignment:
    [junit]   int8    1 / 1, int16   2 / 2
    [junit]   int     4 / 4, long    8 / 8
    [junit]   int32   4 / 4, int64   8 / 8
    [junit]   float   4 / 4, double  8 / 8, ldouble 16 / 16
    [junit]   pointer 8 / 8, page    4096
    [junit] runtime md: MachineDescription: runtimeValidated true, littleEndian true, 32Bit false, primitive size / alignment:
    [junit]   int8    1 / 1, int16   2 / 2
    [junit]   int     4 / 4, long    8 / 8
    [junit]   int32   4 / 4, int64   8 / 8
    [junit]   float   4 / 4, double  8 / 8, ldouble 16 / 16
    [junit]   pointer 8 / 8, page    4096
    [junit] compatible static/runtime: true
    [junit] ++++ TestCase.tearDown: com.jogamp.gluegen.test.junit.generation.Test1p2ProcAddressEmitter - chapter09TestCompoundAlignment
    [junit] ++++ TestCase.setUp: com.jogamp.gluegen.test.junit.generation.Test1p2ProcAddressEmitter - chapter10TestCompoundCallByReference
    [junit] 0x123456789abcdef0 == 0x123456789abcdef0
    [junit] 0xa23456781abcdef0 == 0xa23456781abcdef0
    [junit] 0xb23456782abcdef0 == 0xb23456782abcdef0
    [junit] 0x123456789abcdef0 == 0x123456789abcdef0
    [junit] 0xa23456781abcdef0 == 0xa23456781abcdef0
    [junit] 0xb23456782abcdef0 == 0xb23456782abcdef0
    [junit] 0x123456789abcdef0 == 0x123456789abcdef0
    [junit] 0xa23456781abcdef0 == 0xa23456781abcdef0
    [junit] 0xb23456782abcdef0 == 0xb23456782abcdef0
    [junit] 0x123456789abcdef0 == 0x123456789abcdef0
    [junit] 0xa23456781abcdef0 == 0xa23456781abcdef0
    [junit] 0xb23456782abcdef0 == 0xb23456782abcdef0
    [junit] ch10: ref-dim 286331153/572662306 858993459x1145324612
    [junit] ++++ TestCase.tearDown: com.jogamp.gluegen.test.junit.generation.Test1p2ProcAddressEmitter - chapter10TestCompoundCallByReference
    [junit] ++++ TestCase.setUp: com.jogamp.gluegen.test.junit.generation.Test1p2ProcAddressEmitter - chapter11TestCompoundCallByValue
    [junit] ch11.0: ref-dim 286331153/572662306 858993459x1145324612
    [junit] ch11.0: val-dim 286331153/572662306 858993459x1145324612
    [junit] ch11.1: val-dim 11/22 33x44
    [junit] ch11.2: val-dim 11/22 33x44
    [junit] ch11.3: sameInstanceByVal false
    [junit] ch11.3: sameInstanceByRef false
    [junit] ch11.4: sum-dimArray 12/24 36x48
    [junit] ch11.5: dimsGet[0] 11/22 33x44
    [junit] ch11.5: dimsGet[1] 1/2 3x4
    [junit] ch11.6: sum-dimPair 12/24 36x48
    [junit] ch11.7: zero-dim[0] 0/0 0x0
    [junit] ch11.7: zero-dim[1] 0/0 0x0
    [junit] ch11.8: copyPrim2Dim 11/22 100x200
    [junit] ch11.9: copyDim2Prim 11/22 100x200
    [junit] ch11.10: expRGBAb 0x11, 0x22, 0x33, 0xffffffaa
    [junit] ch11.10: hasRGBAi 0x112233aa
    [junit] ch11.11: hasRGBAb 0x11, 0x22, 0x33, 0xffffffaa
    [junit] ch11.12: addInt 3
    [junit] ch11.13: addByte 3
    [junit] ++++ TestCase.tearDown: com.jogamp.gluegen.test.junit.generation.Test1p2ProcAddressEmitter - chapter11TestCompoundCallByValue
    [junit] ++++ TestCase.setUp: com.jogamp.gluegen.test.junit.generation.Test1p2ProcAddressEmitter - chapter12TestStructArrayModelConst
    [junit] 0x123456789abcdef0 == 0x123456789abcdef0
    [junit] 0x123456789abcdef0 == 0x123456789abcdef0
    [junit] has 'Hello Array'
    [junit] has   0: 0x48 H
    [junit] has   1: 0x65 e
    [junit] has   2: 0x6C l
    [junit] has   3: 0x6C l
    [junit] has   4: 0x6F o
    [junit] has   5: 0x20  
    [junit] has   6: 0x41 A
    [junit] has   7: 0x72 r
    [junit] has   8: 0x72 r
    [junit] has   9: 0x61 a
    [junit] has  10: 0x79 y
    [junit] has 'Hello CString'
    [junit] has   0: 0x48 H
    [junit] has   1: 0x65 e
    [junit] has   2: 0x6C l
    [junit] has   3: 0x6C l
    [junit] has   4: 0x6F o
    [junit] has   5: 0x20  
    [junit] has   6: 0x43 C
    [junit] has   7: 0x53 S
    [junit] has   8: 0x74 t
    [junit] has   9: 0x72 r
    [junit] has  10: 0x69 i
    [junit] has  11: 0x6E n
    [junit] has  12: 0x67 g
    [junit] has 'Hello Pointer'
    [junit] has   0: 0x48 H
    [junit] has   1: 0x65 e
    [junit] has   2: 0x6C l
    [junit] has   3: 0x6C l
    [junit] has   4: 0x6F o
    [junit] has   5: 0x20  
    [junit] has   6: 0x50 P
    [junit] has   7: 0x6F o
    [junit] has   8: 0x69 i
    [junit] has   9: 0x6E n
    [junit] has  10: 0x74 t
    [junit] has  11: 0x65 e
    [junit] has  12: 0x72 r
    [junit] ++++ TestCase.tearDown: com.jogamp.gluegen.test.junit.generation.Test1p2ProcAddressEmitter - chapter12TestStructArrayModelConst
    [junit] ++++ TestCase.setUp: com.jogamp.gluegen.test.junit.generation.Test1p2ProcAddressEmitter - chapter13TestStructArrayModelMutable
    [junit] 0x123456789abcdef0 == 0x123456789abcdef0
    [junit] 0x123456789abcdef0 == 0x123456789abcdef0
    [junit] ++++ TestCase.tearDown: com.jogamp.gluegen.test.junit.generation.Test1p2ProcAddressEmitter - chapter13TestStructArrayModelMutable
    [junit] ------------- ---------------- ---------------
    [junit] Testsuite: com.jogamp.gluegen.test.junit.structgen.TestStructGen01
    [junit] Testsuite: com.jogamp.gluegen.test.junit.structgen.TestStructGen01
    [junit] ++++ TestCase.setUp: com.jogamp.gluegen.test.junit.structgen.TestStructGen01 - test01
    [junit] ++++ TestCase.tearDown: com.jogamp.gluegen.test.junit.structgen.TestStructGen01 - test01
    [junit] ++++ TestCase.setUp: com.jogamp.gluegen.test.junit.structgen.TestStructGen01 - test02
    [junit] ++++ TestCase.tearDown: com.jogamp.gluegen.test.junit.structgen.TestStructGen01 - test02
    [junit] Tests run: 2, Failures: 0, Errors: 0, Time elapsed: 0.08 sec
    [junit] ------------- Standard Error -----------------
    [junit] ++++ TestCase.setUp: com.jogamp.gluegen.test.junit.structgen.TestStructGen01 - test01
    [junit] ++++ TestCase.tearDown: com.jogamp.gluegen.test.junit.structgen.TestStructGen01 - test01
    [junit] ++++ TestCase.setUp: com.jogamp.gluegen.test.junit.structgen.TestStructGen01 - test02
    [junit] ++++ TestCase.tearDown: com.jogamp.gluegen.test.junit.structgen.TestStructGen01 - test02
    [junit] ------------- ---------------- ---------------
    [junit] 
    [junit] Testcase: test01 took 0.015 sec
    [junit] Testcase: test02 took 0.001 sec
    [junit] Tests run: 2, Failures: 0, Errors: 0, Time elapsed: 0.08 sec
    [junit] 
    [junit] ------------- Standard Error -----------------
    [junit] ++++ TestCase.setUp: com.jogamp.gluegen.test.junit.structgen.TestStructGen01 - test01
    [junit] ++++ TestCase.tearDown: com.jogamp.gluegen.test.junit.structgen.TestStructGen01 - test01
    [junit] ++++ TestCase.setUp: com.jogamp.gluegen.test.junit.structgen.TestStructGen01 - test02
    [junit] ++++ TestCase.tearDown: com.jogamp.gluegen.test.junit.structgen.TestStructGen01 - test02
    [junit] ------------- ---------------- ---------------
    [junit] Testsuite: com.jogamp.gluegen.test.junit.structgen.TestStructGen02
    [junit] Testsuite: com.jogamp.gluegen.test.junit.structgen.TestStructGen02
    [junit] ++++ TestCase.setUp: com.jogamp.gluegen.test.junit.structgen.TestStructGen02 - test01
    [junit] ++++ TestCase.tearDown: com.jogamp.gluegen.test.junit.structgen.TestStructGen02 - test01
    [junit] No SecurityManager Installed
    [junit] Tests run: 1, Failures: 0, Errors: 0, Time elapsed: 0.083 sec
    [junit] ------------- Standard Error -----------------
    [junit] ++++ TestCase.setUp: com.jogamp.gluegen.test.junit.structgen.TestStructGen02 - test01
    [junit] ++++ TestCase.tearDown: com.jogamp.gluegen.test.junit.structgen.TestStructGen02 - test01
    [junit] ------------- ---------------- ---------------
    [junit] 
    [junit] Testcase: test01 took 0.002 sec
    [junit] Tests run: 1, Failures: 0, Errors: 0, Time elapsed: 0.083 sec
    [junit] 
    [junit] ------------- Standard Error -----------------
    [junit] ++++ TestCase.setUp: com.jogamp.gluegen.test.junit.structgen.TestStructGen02 - test01
    [junit] ++++ TestCase.tearDown: com.jogamp.gluegen.test.junit.structgen.TestStructGen02 - test01
    [junit] ------------- ---------------- ---------------
    [junit] Testsuite: com.jogamp.junit.sec.TestSecIOUtil01
    [junit] Testsuite: com.jogamp.junit.sec.TestSecIOUtil01
    [junit] ++++ TestCase.setUp: com.jogamp.junit.sec.TestSecIOUtil01 - testProp00_Temp
    [junit] os.name: Mac OS X
    [junit] ++++ TestCase.tearDown: com.jogamp.junit.sec.TestSecIOUtil01 - testProp00_Temp
    [junit] ++++ TestCase.setUp: com.jogamp.junit.sec.TestSecIOUtil01 - testProp01_Temp
    [junit] java.home: /Library/Java/JavaVirtualMachines/jdk1.7.0_60.jdk/Contents/Home/jre
    [junit] ++++ TestCase.tearDown: com.jogamp.junit.sec.TestSecIOUtil01 - testProp01_Temp
    [junit] ++++ TestCase.setUp: com.jogamp.junit.sec.TestSecIOUtil01 - testProp02_Temp
    [junit] java.io.tmpdir: /var/folders/2z/qqs9pzgx5bzgw_nxz34mxg4m0000gp/T/
    [junit] ++++ TestCase.tearDown: com.jogamp.junit.sec.TestSecIOUtil01 - testProp02_Temp
    [junit] ++++ TestCase.setUp: com.jogamp.junit.sec.TestSecIOUtil01 - testTempDir00
    [junit] Temp: /var/folders/2z/qqs9pzgx5bzgw_nxz34mxg4m0000gp/T/jogamp_0000
    [junit] ++++ TestCase.tearDown: com.jogamp.junit.sec.TestSecIOUtil01 - testTempDir00
    [junit] Tests run: 4, Failures: 0, Errors: 0, Time elapsed: 0.091 sec
    [junit] ------------- Standard Error -----------------
    [junit] No SecurityManager Installed
    [junit] ++++ TestCase.setUp: com.jogamp.junit.sec.TestSecIOUtil01 - testProp00_Temp
    [junit] os.name: Mac OS X
    [junit] ++++ TestCase.tearDown: com.jogamp.junit.sec.TestSecIOUtil01 - testProp00_Temp
    [junit] ++++ TestCase.setUp: com.jogamp.junit.sec.TestSecIOUtil01 - testProp01_Temp
    [junit] java.home: /Library/Java/JavaVirtualMachines/jdk1.7.0_60.jdk/Contents/Home/jre
    [junit] ++++ TestCase.tearDown: com.jogamp.junit.sec.TestSecIOUtil01 - testProp01_Temp
    [junit] ++++ TestCase.setUp: com.jogamp.junit.sec.TestSecIOUtil01 - testProp02_Temp
    [junit] java.io.tmpdir: /var/folders/2z/qqs9pzgx5bzgw_nxz34mxg4m0000gp/T/
    [junit] ++++ TestCase.tearDown: com.jogamp.junit.sec.TestSecIOUtil01 - testProp02_Temp
    [junit] ++++ TestCase.setUp: com.jogamp.junit.sec.TestSecIOUtil01 - testTempDir00
    [junit] Temp: /var/folders/2z/qqs9pzgx5bzgw_nxz34mxg4m0000gp/T/jogamp_0000
    [junit] ++++ TestCase.tearDown: com.jogamp.junit.sec.TestSecIOUtil01 - testTempDir00
    [junit] ------------- ---------------- ---------------
    [junit] 
    [junit] Testcase: testProp00_Temp took 0 sec
    [junit] Testcase: testProp01_Temp took 0 sec
    [junit] Testcase: testProp02_Temp took 0.001 sec
    [junit] Testcase: testTempDir00 took 0 sec
    [junit] Tests run: 4, Failures: 0, Errors: 0, Time elapsed: 0.091 sec
    [junit] 
    [junit] ------------- Standard Error -----------------
    [junit] No SecurityManager Installed
    [junit] ++++ TestCase.setUp: com.jogamp.junit.sec.TestSecIOUtil01 - testProp00_Temp
    [junit] os.name: Mac OS X
    [junit] ++++ TestCase.tearDown: com.jogamp.junit.sec.TestSecIOUtil01 - testProp00_Temp
    [junit] ++++ TestCase.setUp: com.jogamp.junit.sec.TestSecIOUtil01 - testProp01_Temp
    [junit] java.home: /Library/Java/JavaVirtualMachines/jdk1.7.0_60.jdk/Contents/Home/jre
    [junit] ++++ TestCase.tearDown: com.jogamp.junit.sec.TestSecIOUtil01 - testProp01_Temp
    [junit] ++++ TestCase.setUp: com.jogamp.junit.sec.TestSecIOUtil01 - testProp02_Temp
    [junit] java.io.tmpdir: /var/folders/2z/qqs9pzgx5bzgw_nxz34mxg4m0000gp/T/
    [junit] ++++ TestCase.tearDown: com.jogamp.junit.sec.TestSecIOUtil01 - testProp02_Temp
    [junit] ++++ TestCase.setUp: com.jogamp.junit.sec.TestSecIOUtil01 - testTempDir00
    [junit] Temp: /var/folders/2z/qqs9pzgx5bzgw_nxz34mxg4m0000gp/T/jogamp_0000
    [junit] ++++ TestCase.tearDown: com.jogamp.junit.sec.TestSecIOUtil01 - testTempDir00
    [junit] ------------- ---------------- ---------------
    [junit] Tests FAILED

junit.run.remote.ssh:

junit.run.remote.adb:

junit.run.tests:

junit.run.if.disabled:

junit.run:
     [echo] gluegen.basename: gluegen

jogamp.env.validation:
     [echo] ant.version                Apache Ant(TM) version 1.8.2 compiled on December 20 2010
     [echo] ant.java.version           1.7
     [echo] java.version               1.7.0_60
     [echo] java.home                  /Library/Java/JavaVirtualMachines/jdk1.7.0_60.jdk/Contents/Home/jre
     [echo] jvmJava.exe                /Library/Java/JavaVirtualMachines/jdk1.7.0_60.jdk/Contents/Home/jre/bin/java
     [echo] jvmJava7.exe               ${jvmJava7.exe}

jogamp.env.init:
     [echo] jogamp.jar.codebase        Codebase: *.jogamp.org
     [echo] jogamp.version             2.2.0-rc-20140703
     [echo] jogamp.version.int         0914019
     [echo] junit.is.disabled          ${junit.is.disabled}
     [echo] target.user.set            true
     [echo] target.sourcelevel         1.6
     [echo] target.targetlevel         1.6
     [echo] target.rt.jar              /opt-share/jre1.6.0_30/lib/rt.jar
     [echo] host.sourcelevel           1.7
     [echo] host.targetlevel           1.7
     [echo] host.rt.jar                /Library/Java/JavaVirtualMachines/jdk1.7.0_60.jdk/Contents/Home/jre/lib/rt.jar
     [echo] javacdebug                 true
     [echo] javacdebuglevel            source,lines
     [echo] javac.memorymax            1024m
     [echo] build.archiveon            ${build.archiveon}
     [echo] build.node.name            macosx64-NV320M-10_7-jogamp-x64-jre7-sgothel-013
     [echo] android.version            9
     [echo] junit.run.arg0             -Djunit.run.arg0=dummy
     [echo] junit.run.arg1             -Djunit.run.arg1=dummy
     [echo] macosx.sdkroot             ${macosx.sdkroot}

gluegen.properties.load.user:

init:

java.class.path.validate:

validate:
     [echo] test.base.dir: ../src/junit 
     [echo] test.junit.generation.dir: ../src/junit/com/jogamp/gluegen/test/junit/generation 
     [echo] test.dir: ../build/test 
     [echo] results: ../build/test/results 
     [echo] build_t: ../build/test/build 
     [echo] build_t.gen: ../build/test/build/gensrc 
     [echo] build_t.java: ../build/test/build/classes 
     [echo] build_t.obj: ../build/test/build/obj 
     [echo] build_t.lib: ../build/test/build/natives 

test-zip-archive:
     [exec] 
     [exec] 7-Zip [64] 9.13 beta  Copyright (c) 1999-2010 Igor Pavlov  2010-04-15
     [exec] p7zip Version 9.13 (locale=utf8,Utf16=on,HugeFiles=on,2 CPUs)
     [exec] Scanning
     [exec] 
     [exec] Creating archive /Users/jogamp/JogAmpSlavex64_jre7/workspace/gluegen/label/macosx-10_7-x86_64-nvidia_jre7/build/gluegen-2.2-b806-20140703-macosx-universal-test-results-macosx64-NV320M-10_7-jogamp-x64-jre7-sgothel-013.7z
     [exec] 
     [exec] Compressing  build/test/results/TEST-com.jogamp.common.net.AssetURLConnectionRegisteredTest.xml
     [exec] Compressing  build/test/results/TEST-com.jogamp.common.net.AssetURLConnectionUnregisteredTest.xml
     [exec] Compressing  build/test/results/TEST-com.jogamp.common.net.TestURIQueryProps.xml
     [exec] Compressing  build/test/results/TEST-com.jogamp.common.net.TestUrisWithAssetHandler.xml
     [exec] Compressing  build/test/results/TEST-com.jogamp.common.nio.BuffersTest.xml
     [exec] Compressing  build/test/results/TEST-com.jogamp.common.nio.CachedBufferFactoryTest.xml
     [exec] Compressing  build/test/results/TEST-com.jogamp.common.nio.TestBuffersFloatDoubleConversion.xml
     [exec] Compressing  build/test/results/TEST-com.jogamp.common.nio.TestPointerBufferEndian.xml
     [exec] Compressing  build/test/results/TEST-com.jogamp.common.nio.TestStructAccessorEndian.xml
     [exec] Compressing  build/test/results/TEST-com.jogamp.common.os.TestElfReader01.xml
     [exec] Compressing  build/test/results/TEST-com.jogamp.common.util.IntIntHashMapTest.xml
     [exec] Compressing  build/test/results/TEST-com.jogamp.common.util.IntObjectHashMapTest.xml
     [exec] Compressing  build/test/results/TEST-com.jogamp.common.util.locks.TestRecursiveLock01.xml
     [exec] Compressing  build/test/results/TEST-com.jogamp.common.util.locks.TestRecursiveThreadGroupLock01.xml
     [exec] Compressing  build/test/results/TEST-com.jogamp.common.util.locks.TestSingletonServerSocket00.xml
     [exec] Compressing  build/test/results/TEST-com.jogamp.common.util.locks.TestSingletonServerSocket01.xml
     [exec] Compressing  build/test/results/TEST-com.jogamp.common.util.locks.TestSingletonServerSocket02.xml
     [exec] Compressing  build/test/results/TEST-com.jogamp.common.util.LongIntHashMapTest.xml
     [exec] Compressing  build/test/results/TEST-com.jogamp.common.util.TestArrayHashSet01.xml
     [exec] Compressing  build/test/results/TEST-com.jogamp.common.util.TestBitstream00.xml
     [exec] Compressing  build/test/results/TEST-com.jogamp.common.util.TestBitstream01.xml
     [exec] Compressing  build/test/results/TEST-com.jogamp.common.util.TestBitstream02.xml
     [exec] Compressing  build/test/results/TEST-com.jogamp.common.util.TestBitstream03.xml
     [exec] Compressing  build/test/results/TEST-com.jogamp.common.util.TestBitstream04.xml
     [exec] Compressing  build/test/results/TEST-com.jogamp.common.util.TestFloatStack01.xml
     [exec] Compressing  build/test/results/TEST-com.jogamp.common.util.TestIntegerStack01.xml
     [exec] Compressing  build/test/results/TEST-com.jogamp.common.util.TestIOUtil01.xml
     [exec] Compressing  build/test/results/TEST-com.jogamp.common.util.TestIOUtilURICompose.xml
     [exec] Compressing  build/test/results/TEST-com.jogamp.common.util.TestIOUtilURIHandling.xml
     [exec] Compressing  build/test/results/TEST-com.jogamp.common.util.TestIteratorIndexCORE.xml
     [exec] Compressing  build/test/results/TEST-com.jogamp.common.util.TestJarUtil.xml
     [exec] Compressing  build/test/results/TEST-com.jogamp.common.util.TestLFRingBuffer01.xml
     [exec] Compressing  build/test/results/TEST-com.jogamp.common.util.TestPlatform01.xml
     [exec] Compressing  build/test/results/TEST-com.jogamp.common.util.TestRunnableTask01.xml
     [exec] Compressing  build/test/results/TEST-com.jogamp.common.util.TestSyncRingBuffer01.xml
     [exec] Compressing  build/test/results/TEST-com.jogamp.common.util.TestSystemPropsAndEnvs.xml
     [exec] Compressing  build/test/results/TEST-com.jogamp.common.util.TestTempJarCache.xml
     [exec] Compressing  build/test/results/TEST-com.jogamp.common.util.TestValueConversion.xml
     [exec] Compressing  build/test/results/TEST-com.jogamp.common.util.TestVersionInfo.xml
     [exec] Compressing  build/test/results/TEST-com.jogamp.common.util.TestVersionNumber.xml
     [exec] Compressing  build/test/results/TEST-com.jogamp.common.util.TestVersionSemantics.xml
     [exec] Compressing  build/test/results/TEST-com.jogamp.gluegen.test.junit.generation.PCPPTest.xml
     [exec] Compressing  build/test/results/TEST-com.jogamp.gluegen.test.junit.generation.Test1p1JavaEmitter.xml
     [exec] Compressing  build/test/results/TEST-com.jogamp.gluegen.test.junit.generation.Test1p2LoadJNIAndImplLib.xml
     [exec] Compressing  build/test/results/TEST-com.jogamp.gluegen.test.junit.generation.Test1p2ProcAddressEmitter.xml
     [exec] Compressing  build/test/results/TEST-com.jogamp.gluegen.test.junit.structgen.TestStructGen01.xml
     [exec] Compressing  build/test/results/TEST-com.jogamp.gluegen.test.junit.structgen.TestStructGen02.xml
     [exec] Compressing  build/test/results/TEST-com.jogamp.junit.sec.TestSecIOUtil01.xml
     [exec] 
     [exec] Everything is Ok

BUILD SUCCESSFUL
Total time: 3 minutes 36 seconds
[WARNINGS] Parsing warnings in console log with parser Java Compiler (javac)
Archiving artifacts
Recording test results
Build step 'Publish JUnit test result report' changed build result to UNSTABLE
[CopyArchiverPublisher] Copying archived artifacts in the shared directory '/srv/www/jogamp.org/deployment/autobuilds/origin/master/gluegen-b806-2014-07-03_16-23-02'.
[CopyArchiverPublisher] '2' artifacts have been copied.
[CopyArchiverPublisher] Stop copying archived artifacts in the shared directory.
Sending e-mails to: chuckslave@jogamp.org
No emails were triggered.
Notifying upstream projects of job completion
Finished: UNSTABLE