UnstableConsole Output

Skipping 1,193 KB.. Full Log
    [junit] ++++ TestCase.setUp: com.jogamp.common.util.TestVersionNumber - test04b
    [junit] ++++ TestCase.tearDown: com.jogamp.common.util.TestVersionNumber - test04b
    [junit] ------------- ---------------- ---------------
    [junit] Testsuite: com.jogamp.common.util.TestVersionSemantics
    [junit] Testsuite: com.jogamp.common.util.TestVersionSemantics
    [junit] Semantic Version Test
    [junit] Previous version: 2.2.0 (2.2.0) - lib/v2.2.0/gluegen-rt.jar
    [junit] Current  version: 2.2.1 (2.2.1-rc-20140831) - /Users/jogamp/JogAmpSlavex64_jre7/workspace/gluegen/label/macosx-10_7-x86_64-nvidia_jre7/build/gluegen-rt.jar
    [junit] Compat. expected: BACKWARD_COMPATIBLE_USER
    [junit] Compat. detected: BACKWARD_COMPATIBLE_USER
    [junit] Compat. result:   detected == expected -> OK
    [junit] Current version 2.2.1 (2.2.1-rc-20140831) is BACKWARD_COMPATIBLE_USER to previous version 2.2.0 (2.2.0), actually BACKWARD_COMPATIBLE_USER
    [junit] 
    [junit] 
    [junit] Summary: 1 differences in 1 classes:
    [junit]   Remove 0, Change 0, Deprecate 0, Add 1
    [junit] 
    [junit]    0/   1: com.jogamp.common.util.IOUtil.StreamMonitor: Remove    0, Change    0, Deprecate    0, Add    1
    [junit] 
    [junit] 
    [junit] Removes
    [junit] 
    [junit] 
    [junit] 
    [junit] Changes
    [junit] 
    [junit] 
    [junit] 
    [junit] Deprecates
    [junit] 
    [junit] 
    [junit] 
    [junit] Additions
    [junit] 
    [junit] Class com.jogamp.common.util.IOUtil.StreamMonitor
    [junit]  Added Class , access public super synchronized
    [junit] 
    [junit] 
    [junit] 
    [junit] 
    [junit] Class Order
    [junit] 
    [junit] Class com.jogamp.common.util.IOUtil.StreamMonitor
    [junit]  Added Class , access public super synchronized
    [junit] ++++ TestCase.tearDown: com.jogamp.common.util.TestVersionSemantics - testVersionLatest
    [junit] Tests run: 1, Failures: 0, Errors: 0, Time elapsed: 0.327 sec
    [junit] ------------- Standard Error -----------------
    [junit] ++++ TestCase.setUp: com.jogamp.common.util.TestVersionSemantics - testVersionLatest
    [junit] Semantic Version Test
    [junit] Previous version: 2.2.0 (2.2.0) - lib/v2.2.0/gluegen-rt.jar
    [junit] Current  version: 2.2.1 (2.2.1-rc-20140831) - /Users/jogamp/JogAmpSlavex64_jre7/workspace/gluegen/label/macosx-10_7-x86_64-nvidia_jre7/build/gluegen-rt.jar
    [junit] Compat. expected: BACKWARD_COMPATIBLE_USER
    [junit] Compat. detected: BACKWARD_COMPATIBLE_USER
    [junit] Compat. result:   detected == expected -> OK
    [junit] Current version 2.2.1 (2.2.1-rc-20140831) is BACKWARD_COMPATIBLE_USER to previous version 2.2.0 (2.2.0), actually BACKWARD_COMPATIBLE_USER
    [junit] 
    [junit] 
    [junit] Summary: 1 differences in 1 classes:
    [junit]   Remove 0, Change 0, Deprecate 0, Add 1
    [junit] 
    [junit]    0/   1: com.jogamp.common.util.IOUtil.StreamMonitor: Remove    0, Change    0, Deprecate    0, Add    1
    [junit] 
    [junit] 
    [junit] Removes
    [junit] 
    [junit] 
    [junit] 
    [junit] Changes
    [junit] 
    [junit] 
    [junit] 
    [junit] Deprecates
    [junit] 
    [junit] 
    [junit] 
    [junit] Additions
    [junit] 
    [junit] Class com.jogamp.common.util.IOUtil.StreamMonitor
    [junit]  Added Class , access public super synchronized
    [junit] 
    [junit] 
    [junit] 
    [junit] 
    [junit] Class Order
    [junit] 
    [junit] Class com.jogamp.common.util.IOUtil.StreamMonitor
    [junit]  Added Class , access public super synchronized
    [junit] ++++ TestCase.tearDown: com.jogamp.common.util.TestVersionSemantics - testVersionLatest
    [junit] ------------- ---------------- ---------------
    [junit] 
    [junit] Testcase: testVersionLatest took 0.246 sec
    [junit] ++++ TestCase.setUp: com.jogamp.common.util.locks.TestRecursiveLock01 - testLockedObjectThreading25x100x100N_Int01_Fair
    [junit] Tests run: 1, Failures: 0, Errors: 0, Time elapsed: 0.327 sec
    [junit] 
    [junit] ------------- Standard Error -----------------
    [junit] ++++ TestCase.setUp: com.jogamp.common.util.TestVersionSemantics - testVersionLatest
    [junit] Semantic Version Test
    [junit] Previous version: 2.2.0 (2.2.0) - lib/v2.2.0/gluegen-rt.jar
    [junit] Current  version: 2.2.1 (2.2.1-rc-20140831) - /Users/jogamp/JogAmpSlavex64_jre7/workspace/gluegen/label/macosx-10_7-x86_64-nvidia_jre7/build/gluegen-rt.jar
    [junit] Compat. expected: BACKWARD_COMPATIBLE_USER
    [junit] Compat. detected: BACKWARD_COMPATIBLE_USER
    [junit] Compat. result:   detected == expected -> OK
    [junit] Current version 2.2.1 (2.2.1-rc-20140831) is BACKWARD_COMPATIBLE_USER to previous version 2.2.0 (2.2.0), actually BACKWARD_COMPATIBLE_USER
    [junit] 
    [junit] 
    [junit] Summary: 1 differences in 1 classes:
    [junit]   Remove 0, Change 0, Deprecate 0, Add 1
    [junit] 
    [junit]    0/   1: com.jogamp.common.util.IOUtil.StreamMonitor: Remove    0, Change    0, Deprecate    0, Add    1
    [junit] 
    [junit] 
    [junit] Removes
    [junit] 
    [junit] 
    [junit] 
    [junit] Changes
    [junit] 
    [junit] 
    [junit] 
    [junit] Deprecates
    [junit] 
    [junit] 
    [junit] 
    [junit] Additions
    [junit] 
    [junit] Class com.jogamp.common.util.IOUtil.StreamMonitor
    [junit]  Added Class , access public super synchronized
    [junit] 
    [junit] 
    [junit] 
    [junit] 
    [junit] Class Order
    [junit] 
    [junit] Class com.jogamp.common.util.IOUtil.StreamMonitor
    [junit]  Added Class , access public super synchronized
    [junit] ++++ TestCase.tearDown: com.jogamp.common.util.TestVersionSemantics - testVersionLatest
    [junit] ------------- ---------------- ---------------
    [junit] Testsuite: com.jogamp.common.util.locks.TestRecursiveLock01
    [junit] Testsuite: com.jogamp.common.util.locks.TestRecursiveLock01
    [junit] 
    [junit] ---- TestRecursiveLock01.testLockedObjectThreading: i Int01, fair  , threads 25, loops-outter    100, loops-inner    100, yield  NONE - dt    625 ms, avrg  3691853 ns, deviation [ -1234883 ..   720707 ] ns
    [junit] ++++ TestCase.tearDown: com.jogamp.common.util.locks.TestRecursiveLock01 - testLockedObjectThreading25x100x100N_Int01_Fair
    [junit] ++++ TestCase.setUp: com.jogamp.common.util.locks.TestRecursiveLock01 - testLockedObjectThreading25x100x100N_Int01_Unfair
    [junit] 
    [junit] ---- TestRecursiveLock01.testLockedObjectThreading: i Int01, unfair, threads 25, loops-outter    100, loops-inner    100, yield  NONE - dt    441 ms, avrg    31193 ns, deviation [   -27803 ..   226617 ] ns
    [junit] ++++ TestCase.tearDown: com.jogamp.common.util.locks.TestRecursiveLock01 - testLockedObjectThreading25x100x100N_Int01_Unfair
    [junit] ++++ TestCase.setUp: com.jogamp.common.util.locks.TestRecursiveLock01 - testLockedObjectThreading25x100x100N_Java5_Fair
    [junit] 
    [junit] ---- TestRecursiveLock01.testLockedObjectThreading: i Java5, fair  , threads 25, loops-outter    100, loops-inner    100, yield  NONE - dt    468 ms, avrg  2964319 ns, deviation [ -2960129 ..   806881 ] ns
    [junit] ++++ TestCase.tearDown: com.jogamp.common.util.locks.TestRecursiveLock01 - testLockedObjectThreading25x100x100N_Java5_Fair
    [junit] ++++ TestCase.setUp: com.jogamp.common.util.locks.TestRecursiveLock01 - testLockedObjectThreading25x100x100N_Java5_Unfair
    [junit] 
    [junit] ---- TestRecursiveLock01.testLockedObjectThreading: i Java5, unfair, threads 25, loops-outter    100, loops-inner    100, yield  NONE - dt    462 ms, avrg  1497486 ns, deviation [ -1493966 ..  2894984 ] ns
    [junit] ++++ TestCase.tearDown: com.jogamp.common.util.locks.TestRecursiveLock01 - testLockedObjectThreading25x100x100N_Java5_Unfair
    [junit] ++++ TestCase.setUp: com.jogamp.common.util.locks.TestRecursiveLock01 - testLockedObjectThreading25x100x100Y_Int01_Fair
    [junit] 
    [junit] ---- TestRecursiveLock01.testLockedObjectThreading: i Int01, fair  , threads 25, loops-outter    100, loops-inner    100, yield YIELD - dt   3416 ms, avrg 32143170 ns, deviation [  -339990 ..   712210 ] ns
    [junit] ++++ TestCase.tearDown: com.jogamp.common.util.locks.TestRecursiveLock01 - testLockedObjectThreading25x100x100Y_Int01_Fair
    [junit] ++++ TestCase.setUp: com.jogamp.common.util.locks.TestRecursiveLock01 - testLockedObjectThreading25x100x100Y_Int01_Unair
    [junit] 
    [junit] ---- TestRecursiveLock01.testLockedObjectThreading: i Int01, unfair, threads 25, loops-outter    100, loops-inner    100, yield YIELD - dt    797 ms, avrg  6830683 ns, deviation [  -171593 ..    95367 ] ns
    [junit] ++++ TestCase.tearDown: com.jogamp.common.util.locks.TestRecursiveLock01 - testLockedObjectThreading25x100x100Y_Int01_Unair
    [junit] ++++ TestCase.setUp: com.jogamp.common.util.locks.TestRecursiveLock01 - testLockedObjectThreading25x100x100Y_Java5_Fair
    [junit] 
    [junit] ---- TestRecursiveLock01.testLockedObjectThreading: i Java5, fair  , threads 25, loops-outter    100, loops-inner    100, yield YIELD - dt    578 ms, avrg  4439664 ns, deviation [  -117064 ..   156646 ] ns
    [junit] ++++ TestCase.tearDown: com.jogamp.common.util.locks.TestRecursiveLock01 - testLockedObjectThreading25x100x100Y_Java5_Fair
    [junit] ++++ TestCase.setUp: com.jogamp.common.util.locks.TestRecursiveLock01 - testLockedObjectThreading25x100x100Y_Java5_Unfair
    [junit] 
    [junit] ---- TestRecursiveLock01.testLockedObjectThreading: i Java5, unfair, threads 25, loops-outter    100, loops-inner    100, yield YIELD - dt    536 ms, avrg 12768014 ns, deviation [ -10461184 .. 16038186 ] ns
    [junit] ++++ TestCase.tearDown: com.jogamp.common.util.locks.TestRecursiveLock01 - testLockedObjectThreading25x100x100Y_Java5_Unfair
    [junit] ++++ TestCase.setUp: com.jogamp.common.util.locks.TestRecursiveLock01 - testLockedObjectThreading5x1000x10000N_Int01_Fair
    [junit] 
    [junit] ---- TestRecursiveLock01.testLockedObjectThreading: i Int01, fair  , threads  5, loops-outter   1000, loops-inner  10000, yield  NONE - dt    560 ms, avrg   157600 ns, deviation [   -23109 ..    14627 ] ns
    [junit] ++++ TestCase.tearDown: com.jogamp.common.util.locks.TestRecursiveLock01 - testLockedObjectThreading5x1000x10000N_Int01_Fair
    [junit] ++++ TestCase.setUp: com.jogamp.common.util.locks.TestRecursiveLock01 - testLockedObjectThreading5x1000x10000N_Int01_Unfair
    [junit] 
    [junit] ---- TestRecursiveLock01.testLockedObjectThreading: i Int01, unfair, threads  5, loops-outter   1000, loops-inner  10000, yield  NONE - dt    675 ms, avrg     4287 ns, deviation [    -1865 ..     3136 ] ns
    [junit] ++++ TestCase.tearDown: com.jogamp.common.util.locks.TestRecursiveLock01 - testLockedObjectThreading5x1000x10000N_Int01_Unfair
    [junit] ++++ TestCase.setUp: com.jogamp.common.util.locks.TestRecursiveLock01 - testLockedObjectThreading5x1000x10000N_Java5_Fair
    [junit] 
    [junit] ---- TestRecursiveLock01.testLockedObjectThreading: i Java5, fair  , threads  5, loops-outter   1000, loops-inner  10000, yield  NONE - dt    672 ms, avrg   514707 ns, deviation [   -12346 ..    11393 ] ns
    [junit] ++++ TestCase.tearDown: com.jogamp.common.util.locks.TestRecursiveLock01 - testLockedObjectThreading5x1000x10000N_Java5_Fair
    [junit] ++++ TestCase.setUp: com.jogamp.common.util.locks.TestRecursiveLock01 - testLockedObjectThreading5x1000x10000N_Java5_Unfair
    [junit] 
    [junit] ---- TestRecursiveLock01.testLockedObjectThreading: i Java5, unfair, threads  5, loops-outter   1000, loops-inner  10000, yield  NONE - dt    995 ms, avrg   143418 ns, deviation [  -142858 ..   442638 ] ns
    [junit] ++++ TestCase.tearDown: com.jogamp.common.util.locks.TestRecursiveLock01 - testLockedObjectThreading5x1000x10000N_Java5_Unfair
    [junit] Tests run: 12, Failures: 0, Errors: 0, Time elapsed: 10.324 sec
    [junit] ------------- Standard Error -----------------
    [junit] ++++ TestCase.setUp: com.jogamp.common.util.locks.TestRecursiveLock01 - testLockedObjectThreading25x100x100N_Int01_Fair
    [junit] 
    [junit] ---- TestRecursiveLock01.testLockedObjectThreading: i Int01, fair  , threads 25, loops-outter    100, loops-inner    100, yield  NONE - dt    625 ms, avrg  3691853 ns, deviation [ -1234883 ..   720707 ] ns
    [junit] ++++ TestCase.tearDown: com.jogamp.common.util.locks.TestRecursiveLock01 - testLockedObjectThreading25x100x100N_Int01_Fair
    [junit] ++++ TestCase.setUp: com.jogamp.common.util.locks.TestRecursiveLock01 - testLockedObjectThreading25x100x100N_Int01_Unfair
    [junit] 
    [junit] ---- TestRecursiveLock01.testLockedObjectThreading: i Int01, unfair, threads 25, loops-outter    100, loops-inner    100, yield  NONE - dt    441 ms, avrg    31193 ns, deviation [   -27803 ..   226617 ] ns
    [junit] ++++ TestCase.tearDown: com.jogamp.common.util.locks.TestRecursiveLock01 - testLockedObjectThreading25x100x100N_Int01_Unfair
    [junit] ++++ TestCase.setUp: com.jogamp.common.util.locks.TestRecursiveLock01 - testLockedObjectThreading25x100x100N_Java5_Fair
    [junit] 
    [junit] ---- TestRecursiveLock01.testLockedObjectThreading: i Java5, fair  , threads 25, loops-outter    100, loops-inner    100, yield  NONE - dt    468 ms, avrg  2964319 ns, deviation [ -2960129 ..   806881 ] ns
    [junit] ++++ TestCase.tearDown: com.jogamp.common.util.locks.TestRecursiveLock01 - testLockedObjectThreading25x100x100N_Java5_Fair
    [junit] ++++ TestCase.setUp: com.jogamp.common.util.locks.TestRecursiveLock01 - testLockedObjectThreading25x100x100N_Java5_Unfair
    [junit] 
    [junit] ---- TestRecursiveLock01.testLockedObjectThreading: i Java5, unfair, threads 25, loops-outter    100, loops-inner    100, yield  NONE - dt    462 ms, avrg  1497486 ns, deviation [ -1493966 ..  2894984 ] ns
    [junit] ++++ TestCase.tearDown: com.jogamp.common.util.locks.TestRecursiveLock01 - testLockedObjectThreading25x100x100N_Java5_Unfair
    [junit] ++++ TestCase.setUp: com.jogamp.common.util.locks.TestRecursiveLock01 - testLockedObjectThreading25x100x100Y_Int01_Fair
    [junit] 
    [junit] ---- TestRecursiveLock01.testLockedObjectThreading: i Int01, fair  , threads 25, loops-outter    100, loops-inner    100, yield YIELD - dt   3416 ms, avrg 32143170 ns, deviation [  -339990 ..   712210 ] ns
    [junit] ++++ TestCase.tearDown: com.jogamp.common.util.locks.TestRecursiveLock01 - testLockedObjectThreading25x100x100Y_Int01_Fair
    [junit] ++++ TestCase.setUp: com.jogamp.common.util.locks.TestRecursiveLock01 - testLockedObjectThreading25x100x100Y_Int01_Unair
    [junit] 
    [junit] ---- TestRecursiveLock01.testLockedObjectThreading: i Int01, unfair, threads 25, loops-outter    100, loops-inner    100, yield YIELD - dt    797 ms, avrg  6830683 ns, deviation [  -171593 ..    95367 ] ns
    [junit] ++++ TestCase.tearDown: com.jogamp.common.util.locks.TestRecursiveLock01 - testLockedObjectThreading25x100x100Y_Int01_Unair
    [junit] ++++ TestCase.setUp: com.jogamp.common.util.locks.TestRecursiveLock01 - testLockedObjectThreading25x100x100Y_Java5_Fair
    [junit] 
    [junit] ---- TestRecursiveLock01.testLockedObjectThreading: i Java5, fair  , threads 25, loops-outter    100, loops-inner    100, yield YIELD - dt    578 ms, avrg  4439664 ns, deviation [  -117064 ..   156646 ] ns
    [junit] ++++ TestCase.tearDown: com.jogamp.common.util.locks.TestRecursiveLock01 - testLockedObjectThreading25x100x100Y_Java5_Fair
    [junit] ++++ TestCase.setUp: com.jogamp.common.util.locks.TestRecursiveLock01 - testLockedObjectThreading25x100x100Y_Java5_Unfair
    [junit] 
    [junit] ---- TestRecursiveLock01.testLockedObjectThreading: i Java5, unfair, threads 25, loops-outter    100, loops-inner    100, yield YIELD - dt    536 ms, avrg 12768014 ns, deviation [ -10461184 .. 16038186 ] ns
    [junit] ++++ TestCase.tearDown: com.jogamp.common.util.locks.TestRecursiveLock01 - testLockedObjectThreading25x100x100Y_Java5_Unfair
    [junit] ++++ TestCase.setUp: com.jogamp.common.util.locks.TestRecursiveLock01 - testLockedObjectThreading5x1000x10000N_Int01_Fair
    [junit] 
    [junit] ---- TestRecursiveLock01.testLockedObjectThreading: i Int01, fair  , threads  5, loops-outter   1000, loops-inner  10000, yield  NONE - dt    560 ms, avrg   157600 ns, deviation [   -23109 ..    14627 ] ns
    [junit] ++++ TestCase.tearDown: com.jogamp.common.util.locks.TestRecursiveLock01 - testLockedObjectThreading5x1000x10000N_Int01_Fair
    [junit] ++++ TestCase.setUp: com.jogamp.common.util.locks.TestRecursiveLock01 - testLockedObjectThreading5x1000x10000N_Int01_Unfair
    [junit] 
    [junit] ---- TestRecursiveLock01.testLockedObjectThreading: i Int01, unfair, threads  5, loops-outter   1000, loops-inner  10000, yield  NONE - dt    675 ms, avrg     4287 ns, deviation [    -1865 ..     3136 ] ns
    [junit] ++++ TestCase.tearDown: com.jogamp.common.util.locks.TestRecursiveLock01 - testLockedObjectThreading5x1000x10000N_Int01_Unfair
    [junit] ++++ TestCase.setUp: com.jogamp.common.util.locks.TestRecursiveLock01 - testLockedObjectThreading5x1000x10000N_Java5_Fair
    [junit] 
    [junit] ---- TestRecursiveLock01.testLockedObjectThreading: i Java5, fair  , threads  5, loops-outter   1000, loops-inner  10000, yield  NONE - dt    672 ms, avrg   514707 ns, deviation [   -12346 ..    11393 ] ns
    [junit] ++++ TestCase.tearDown: com.jogamp.common.util.locks.TestRecursiveLock01 - testLockedObjectThreading5x1000x10000N_Java5_Fair
    [junit] ++++ TestCase.setUp: com.jogamp.common.util.locks.TestRecursiveLock01 - testLockedObjectThreading5x1000x10000N_Java5_Unfair
    [junit] 
    [junit] ---- TestRecursiveLock01.testLockedObjectThreading: i Java5, unfair, threads  5, loops-outter   1000, loops-inner  10000, yield  NONE - dt    995 ms, avrg   143418 ns, deviation [  -142858 ..   442638 ] ns
    [junit] ++++ TestCase.tearDown: com.jogamp.common.util.locks.TestRecursiveLock01 - testLockedObjectThreading5x1000x10000N_Java5_Unfair
    [junit] ------------- ---------------- ---------------
    [junit] 
    [junit] Testcase: testLockedObjectThreading25x100x100N_Int01_Fair took 0.626 sec
    [junit] Testcase: testLockedObjectThreading25x100x100N_Int01_Unfair took 0.441 sec
    [junit] Testcase: testLockedObjectThreading25x100x100N_Java5_Fair took 0.469 sec
    [junit] Testcase: testLockedObjectThreading25x100x100N_Java5_Unfair took 0.463 sec
    [junit] Testcase: testLockedObjectThreading25x100x100Y_Int01_Fair took 3.416 sec
    [junit] Testcase: testLockedObjectThreading25x100x100Y_Int01_Unair took 0.797 sec
    [junit] Testcase: testLockedObjectThreading25x100x100Y_Java5_Fair took 0.579 sec
    [junit] Testcase: testLockedObjectThreading25x100x100Y_Java5_Unfair took 0.536 sec
    [junit] Testcase: testLockedObjectThreading5x1000x10000N_Int01_Fair took 0.56 sec
    [junit] Testcase: testLockedObjectThreading5x1000x10000N_Int01_Unfair took 0.675 sec
    [junit] Testcase: testLockedObjectThreading5x1000x10000N_Java5_Fair took 0.673 sec
    [junit] Testcase: testLockedObjectThreading5x1000x10000N_Java5_Unfair took 0.995 sec
    [junit] Tests run: 12, Failures: 0, Errors: 0, Time elapsed: 10.324 sec
    [junit] 
    [junit] ------------- Standard Error -----------------
    [junit] ++++ TestCase.setUp: com.jogamp.common.util.locks.TestRecursiveLock01 - testLockedObjectThreading25x100x100N_Int01_Fair
    [junit] 
    [junit] ---- TestRecursiveLock01.testLockedObjectThreading: i Int01, fair  , threads 25, loops-outter    100, loops-inner    100, yield  NONE - dt    625 ms, avrg  3691853 ns, deviation [ -1234883 ..   720707 ] ns
    [junit] ++++ TestCase.tearDown: com.jogamp.common.util.locks.TestRecursiveLock01 - testLockedObjectThreading25x100x100N_Int01_Fair
    [junit] ++++ TestCase.setUp: com.jogamp.common.util.locks.TestRecursiveLock01 - testLockedObjectThreading25x100x100N_Int01_Unfair
    [junit] 
    [junit] ---- TestRecursiveLock01.testLockedObjectThreading: i Int01, unfair, threads 25, loops-outter    100, loops-inner    100, yield  NONE - dt    441 ms, avrg    31193 ns, deviation [   -27803 ..   226617 ] ns
    [junit] ++++ TestCase.tearDown: com.jogamp.common.util.locks.TestRecursiveLock01 - testLockedObjectThreading25x100x100N_Int01_Unfair
    [junit] ++++ TestCase.setUp: com.jogamp.common.util.locks.TestRecursiveLock01 - testLockedObjectThreading25x100x100N_Java5_Fair
    [junit] 
    [junit] ---- TestRecursiveLock01.testLockedObjectThreading: i Java5, fair  , threads 25, loops-outter    100, loops-inner    100, yield  NONE - dt    468 ms, avrg  2964319 ns, deviation [ -2960129 ..   806881 ] ns
    [junit] ++++ TestCase.tearDown: com.jogamp.common.util.locks.TestRecursiveLock01 - testLockedObjectThreading25x100x100N_Java5_Fair
    [junit] ++++ TestCase.setUp: com.jogamp.common.util.locks.TestRecursiveLock01 - testLockedObjectThreading25x100x100N_Java5_Unfair
    [junit] 
    [junit] ---- TestRecursiveLock01.testLockedObjectThreading: i Java5, unfair, threads 25, loops-outter    100, loops-inner    100, yield  NONE - dt    462 ms, avrg  1497486 ns, deviation [ -1493966 ..  2894984 ] ns
    [junit] ++++ TestCase.tearDown: com.jogamp.common.util.locks.TestRecursiveLock01 - testLockedObjectThreading25x100x100N_Java5_Unfair
    [junit] ++++ TestCase.setUp: com.jogamp.common.util.locks.TestRecursiveLock01 - testLockedObjectThreading25x100x100Y_Int01_Fair
    [junit] 
    [junit] ---- TestRecursiveLock01.testLockedObjectThreading: i Int01, fair  , threads 25, loops-outter    100, loops-inner    100, yield YIELD - dt   3416 ms, avrg 32143170 ns, deviation [  -339990 ..   712210 ] ns
    [junit] ++++ TestCase.tearDown: com.jogamp.common.util.locks.TestRecursiveLock01 - testLockedObjectThreading25x100x100Y_Int01_Fair
    [junit] ++++ TestCase.setUp: com.jogamp.common.util.locks.TestRecursiveLock01 - testLockedObjectThreading25x100x100Y_Int01_Unair
    [junit] 
    [junit] ---- TestRecursiveLock01.testLockedObjectThreading: i Int01, unfair, threads 25, loops-outter    100, loops-inner    100, yield YIELD - dt    797 ms, avrg  6830683 ns, deviation [  -171593 ..    95367 ] ns
    [junit] ++++ TestCase.tearDown: com.jogamp.common.util.locks.TestRecursiveLock01 - testLockedObjectThreading25x100x100Y_Int01_Unair
    [junit] ++++ TestCase.setUp: com.jogamp.common.util.locks.TestRecursiveLock01 - testLockedObjectThreading25x100x100Y_Java5_Fair
    [junit] 
    [junit] ---- TestRecursiveLock01.testLockedObjectThreading: i Java5, fair  , threads 25, loops-outter    100, loops-inner    100, yield YIELD - dt    578 ms, avrg  4439664 ns, deviation [  -117064 ..   156646 ] ns
    [junit] ++++ TestCase.tearDown: com.jogamp.common.util.locks.TestRecursiveLock01 - testLockedObjectThreading25x100x100Y_Java5_Fair
    [junit] ++++ TestCase.setUp: com.jogamp.common.util.locks.TestRecursiveLock01 - testLockedObjectThreading25x100x100Y_Java5_Unfair
    [junit] 
    [junit] ---- TestRecursiveLock01.testLockedObjectThreading: i Java5, unfair, threads 25, loops-outter    100, loops-inner    100, yield YIELD - dt    536 ms, avrg 12768014 ns, deviation [ -10461184 .. 16038186 ] ns
    [junit] ++++ TestCase.tearDown: com.jogamp.common.util.locks.TestRecursiveLock01 - testLockedObjectThreading25x100x100Y_Java5_Unfair
    [junit] ++++ TestCase.setUp: com.jogamp.common.util.locks.TestRecursiveLock01 - testLockedObjectThreading5x1000x10000N_Int01_Fair
    [junit] 
    [junit] ---- TestRecursiveLock01.testLockedObjectThreading: i Int01, fair  , threads  5, loops-outter   1000, loops-inner  10000, yield  NONE - dt    560 ms, avrg   157600 ns, deviation [   -23109 ..    14627 ] ns
    [junit] ++++ TestCase.tearDown: com.jogamp.common.util.locks.TestRecursiveLock01 - testLockedObjectThreading5x1000x10000N_Int01_Fair
    [junit] ++++ TestCase.setUp: com.jogamp.common.util.locks.TestRecursiveLock01 - testLockedObjectThreading5x1000x10000N_Int01_Unfair
    [junit] 
    [junit] ---- TestRecursiveLock01.testLockedObjectThreading: i Int01, unfair, threads  5, loops-outter   1000, loops-inner  10000, yield  NONE - dt    675 ms, avrg     4287 ns, deviation [    -1865 ..     3136 ] ns
    [junit] ++++ TestCase.tearDown: com.jogamp.common.util.locks.TestRecursiveLock01 - testLockedObjectThreading5x1000x10000N_Int01_Unfair
    [junit] ++++ TestCase.setUp: com.jogamp.common.util.locks.TestRecursiveLock01 - testLockedObjectThreading5x1000x10000N_Java5_Fair
    [junit] 
    [junit] ---- TestRecursiveLock01.testLockedObjectThreading: i Java5, fair  , threads  5, loops-outter   1000, loops-inner  10000, yield  NONE - dt    672 ms, avrg   514707 ns, deviation [   -12346 ..    11393 ] ns
    [junit] ++++ TestCase.tearDown: com.jogamp.common.util.locks.TestRecursiveLock01 - testLockedObjectThreading5x1000x10000N_Java5_Fair
    [junit] ++++ TestCase.setUp: com.jogamp.common.util.locks.TestRecursiveLock01 - testLockedObjectThreading5x1000x10000N_Java5_Unfair
    [junit] 
    [junit] ---- TestRecursiveLock01.testLockedObjectThreading: i Java5, unfair, threads  5, loops-outter   1000, loops-inner  10000, yield  NONE - dt    995 ms, avrg   143418 ns, deviation [  -142858 ..   442638 ] ns
    [junit] ++++ TestCase.tearDown: com.jogamp.common.util.locks.TestRecursiveLock01 - testLockedObjectThreading5x1000x10000N_Java5_Unfair
    [junit] ------------- ---------------- ---------------
    [junit] Testsuite: com.jogamp.common.util.locks.TestRecursiveThreadGroupLock01
    [junit] Testsuite: com.jogamp.common.util.locks.TestRecursiveThreadGroupLock01
    [junit] ++++ TestCase.setUp: com.jogamp.common.util.locks.TestRecursiveThreadGroupLock01 - testTwoThreadsInGroup
    [junit] 
    [junit] ---- TestRecursiveLock01.testLockedObjectThreading: i Int02ThreadGroup, fair  , threads  5, loops-outter   1000, loops-inner  10000, yield YIELD - dt    198 ms
    [junit] ++++ TestCase.tearDown: com.jogamp.common.util.locks.TestRecursiveThreadGroupLock01 - testTwoThreadsInGroup
    [junit] Tests run: 1, Failures: 0, Errors: 0, Time elapsed: 0.259 sec
    [junit] ------------- Standard Error -----------------
    [junit] ++++ TestCase.setUp: com.jogamp.common.util.locks.TestRecursiveThreadGroupLock01 - testTwoThreadsInGroup
    [junit] 
    [junit] ---- TestRecursiveLock01.testLockedObjectThreading: i Int02ThreadGroup, fair  , threads  5, loops-outter   1000, loops-inner  10000, yield YIELD - dt    198 ms
    [junit] ++++ TestCase.tearDown: com.jogamp.common.util.locks.TestRecursiveThreadGroupLock01 - testTwoThreadsInGroup
    [junit] ------------- ---------------- ---------------
    [junit] 
    [junit] Testcase: testTwoThreadsInGroup took 0.198 sec
    [junit] Tests run: 1, Failures: 0, Errors: 0, Time elapsed: 0.259 sec
    [junit] 
    [junit] ------------- Standard Error -----------------
    [junit] ++++ TestCase.setUp: com.jogamp.common.util.locks.TestRecursiveThreadGroupLock01 - testTwoThreadsInGroup
    [junit] 
    [junit] ---- TestRecursiveLock01.testLockedObjectThreading: i Int02ThreadGroup, fair  , threads  5, loops-outter   1000, loops-inner  10000, yield YIELD - dt    198 ms
    [junit] ++++ TestCase.tearDown: com.jogamp.common.util.locks.TestRecursiveThreadGroupLock01 - testTwoThreadsInGroup
    [junit] ------------- ---------------- ---------------
    [junit] Testsuite: com.jogamp.common.util.locks.TestSingletonServerSocket00
    [junit] Testsuite: com.jogamp.common.util.locks.TestSingletonServerSocket00
    [junit] Thread-3 - SISock: localhost/127.0.0.1:59999 - started
    [junit] SLOCK [T main @ 1409512226637 ms +++ localhost/127.0.0.1:59999 - Locked within 33 ms, 1 attempts
    [junit] SLOCK [T main @ 1409512226639 ms III localhost/127.0.0.1:59999 - Wait for lock
    [junit] SLOCK [T main @ 1409512227667 ms +++ EEE (2) localhost/127.0.0.1:59999 - couldn't get lock within 1029 ms, 10 attempts
    [junit] SLOCK [T main @ 1409512227701 ms --- localhost/127.0.0.1:59999 - Unlock ok within 1 ms
    [junit] Thread-5 - SISock: localhost/127.0.0.1:59999 - started
    [junit] SLOCK [T main @ 1409512227702 ms +++ localhost/127.0.0.1:59999 - Locked within 0 ms, 1 attempts
    [junit] SLOCK [T main @ 1409512227736 ms --- localhost/127.0.0.1:59999 - Unlock ok within 0 ms
    [junit] Thread-6 - SISock: localhost/127.0.0.1:59999 - started
    [junit] SLOCK [T main @ 1409512227737 ms +++ localhost/127.0.0.1:59999 - Locked within 0 ms, 1 attempts
    [junit] LockUnlock #1 LOCK try ..
    [junit] LockUnlock #2 LOCK try ..
    [junit] SLOCK [T LockUnlock #1 @ 1409512227739 ms III localhost/127.0.0.1:59999 - Wait for lock
    [junit] SLOCK [T LockUnlock #2 @ 1409512227739 ms III localhost/127.0.0.1:59999 - Wait for lock
    [junit] SLOCK [T main @ 1409512228076 ms --- localhost/127.0.0.1:59999 - Unlock ok within 1 ms
    [junit] Thread-9 - SISock: localhost/127.0.0.1:59999 - started
    [junit] SLOCK [T LockUnlock #2 @ 1409512228088 ms +++ localhost/127.0.0.1:59999 - Locked within 350 ms, 27 attempts
    [junit] LockUnlock #2 LOCK ON
    [junit] SLOCK [T LockUnlock #2 @ 1409512228389 ms --- localhost/127.0.0.1:59999 - Unlock ok within 0 ms
    [junit] LockUnlock #2 LOCK OFF
    [junit] SLOCK [T LockUnlock #1 @ 1409512228830 ms +++ EEE (2) localhost/127.0.0.1:59999 - couldn't get lock within 1092 ms, 3 attempts
    [junit] Exception in thread "LockUnlock #1" java.lang.AssertionError: LockUnlock #1 - Could not lock instance: localhost/127.0.0.1:59999
    [junit] 	at org.junit.Assert.fail(Assert.java:88)
    [junit] 	at org.junit.Assert.assertTrue(Assert.java:41)
    [junit] Tests run: 3, Failures: 0, Errors: 0, Time elapsed: 2.293 sec
    [junit] ------------- Standard Error -----------------
    [junit] Thread-3 - SISock: localhost/127.0.0.1:59999 - started
    [junit] SLOCK [T main @ 1409512226637 ms +++ localhost/127.0.0.1:59999 - Locked within 33 ms, 1 attempts
    [junit] SLOCK [T main @ 1409512226639 ms III localhost/127.0.0.1:59999 - Wait for lock
    [junit] SLOCK [T main @ 1409512227667 ms +++ EEE (2) localhost/127.0.0.1:59999 - couldn't get lock within 1029 ms, 10 attempts
    [junit] SLOCK [T main @ 1409512227701 ms --- localhost/127.0.0.1:59999 - Unlock ok within 1 ms
    [junit] Thread-5 - SISock: localhost/127.0.0.1:59999 - started
    [junit] SLOCK [T main @ 1409512227702 ms +++ localhost/127.0.0.1:59999 - Locked within 0 ms, 1 attempts
    [junit] SLOCK [T main @ 1409512227736 ms --- localhost/127.0.0.1:59999 - Unlock ok within 0 ms
    [junit] Thread-6 - SISock: localhost/127.0.0.1:59999 - started
    [junit] SLOCK [T main @ 1409512227737 ms +++ localhost/127.0.0.1:59999 - Locked within 0 ms, 1 attempts
    [junit] LockUnlock #1 LOCK try ..
    [junit] LockUnlock #2 LOCK try ..
    [junit] SLOCK [T LockUnlock #1 @ 1409512227739 ms III localhost/127.0.0.1:59999 - Wait for lock
    [junit] SLOCK [T LockUnlock #2 @ 1409512227739 ms III localhost/127.0.0.1:59999 - Wait for lock
    [junit] SLOCK [T main @ 1409512228076 ms --- localhost/127.0.0.1:59999 - Unlock ok within 1 ms
    [junit] Thread-9 - SISock: localhost/127.0.0.1:59999 - started
    [junit] SLOCK [T LockUnlock #2 @ 1409512228088 ms +++ localhost/127.0.0.1:59999 - Locked within 350 ms, 27 attempts
    [junit] LockUnlock #2 LOCK ON
    [junit] SLOCK [T LockUnlock #2 @ 1409512228389 ms --- localhost/127.0.0.1:59999 - Unlock ok within 0 ms
    [junit] LockUnlock #2 LOCK OFF
    [junit] SLOCK [T LockUnlock #1 @ 1409512228830 ms +++ EEE (2) localhost/127.0.0.1:59999 - couldn't get lock within 1092 ms, 3 attempts
    [junit] Exception in thread "LockUnlock #1" java.lang.AssertionError: LockUnlock #1 - Could not lock instance: localhost/127.0.0.1:59999
    [junit] 	at org.junit.Assert.fail(Assert.java:88)
    [junit] 	at org.junit.Assert.assertTrue(Assert.java:41)
    [junit] 	at com.jogamp.common.util.locks.TestSingletonServerSocket00$1.run(TestSingletonServerSocket00.java:74)
    [junit] 	at java.lang.Thread.run(Thread.java:745)
    [junit] ------------- ---------------- ---------------
    [junit] 
    [junit] Testcase: test2ndInstanceLockTimeout took 1.097 sec
    [junit] Testcase: testLockUnlock took 0.034 sec
    [junit] Testcase: testOffthreadLockUnlock took 1.155 sec
    [junit] Tests run: 3, Failures: 0, Errors: 0, Time elapsed: 2.293 sec
    [junit] 
    [junit] ------------- Standard Error -----------------
    [junit] Thread-3 - SISock: localhost/127.0.0.1:59999 - started
    [junit] SLOCK [T main @ 1409512226637 ms +++ localhost/127.0.0.1:59999 - Locked within 33 ms, 1 attempts
    [junit] SLOCK [T main @ 1409512226639 ms III localhost/127.0.0.1:59999 - Wait for lock
    [junit] SLOCK [T main @ 1409512227667 ms +++ EEE (2) localhost/127.0.0.1:59999 - couldn't get lock within 1029 ms, 10 attempts
    [junit] SLOCK [T main @ 1409512227701 ms --- localhost/127.0.0.1:59999 - Unlock ok within 1 ms
    [junit] Thread-5 - SISock: localhost/127.0.0.1:59999 - started
    [junit] SLOCK [T main @ 1409512227702 ms +++ localhost/127.0.0.1:59999 - Locked within 0 ms, 1 attempts
    [junit] SLOCK [T main @ 1409512227736 ms --- localhost/127.0.0.1:59999 - Unlock ok within 0 ms
    [junit] Thread-6 - SISock: localhost/127.0.0.1:59999 - started
    [junit] SLOCK [T main @ 1409512227737 ms +++ localhost/127.0.0.1:59999 - Locked within 0 ms, 1 attempts
    [junit] LockUnlock #1 LOCK try ..
    [junit] LockUnlock #2 LOCK try ..
    [junit] SLOCK [T LockUnlock #1 @ 1409512227739 ms III localhost/127.0.0.1:59999 - Wait for lock
    [junit] SLOCK [T LockUnlock #2 @ 1409512227739 ms III localhost/127.0.0.1:59999 - Wait for lock
    [junit] SLOCK [T main @ 1409512228076 ms --- localhost/127.0.0.1:59999 - Unlock ok within 1 ms
    [junit] Thread-9 - SISock: localhost/127.0.0.1:59999 - started
    [junit] SLOCK [T LockUnlock #2 @ 1409512228088 ms +++ localhost/127.0.0.1:59999 - Locked within 350 ms, 27 attempts
    [junit] LockUnlock #2 LOCK ON
    [junit] SLOCK [T LockUnlock #2 @ 1409512228389 ms --- localhost/127.0.0.1:59999 - Unlock ok within 0 ms
    [junit] LockUnlock #2 LOCK OFF
    [junit] SLOCK [T LockUnlock #1 @ 1409512228830 ms +++ EEE (2) localhost/127.0.0.1:59999 - couldn't get lock within 1092 ms, 3 attempts
    [junit] Exception in thread "LockUnlock #1" java.lang.AssertionError: LockUnlock #1 - Could not lock instance: localhost/127.0.0.1:59999
    [junit] 	at org.junit.Assert.fail(Assert.java:88)
    [junit] 	at org.junit.Assert.assertTrue(Assert.java:41)
    [junit] 	at com.jogamp.common.util.locks.TestSingletonServerSocket00$1.run(TestSingletonServerSocket00.java:74)
    [junit] 	at java.lang.Thread.run(Thread.java:745)
    [junit] ------------- ---------------- ---------------
    [junit] Testsuite: com.jogamp.common.util.locks.TestSingletonServerSocket01
    [junit] Testsuite: com.jogamp.common.util.locks.TestSingletonServerSocket01
    [junit] 	at com.jogamp.common.util.locks.TestSingletonServerSocket00$1.run(TestSingletonServerSocket00.java:74)
    [junit] 	at java.lang.Thread.run(Thread.java:745)
    [junit] SLOCK [T main @ 1409512228903 ms III localhost/127.0.0.1:59999 - Wait for lock
    [junit] Thread-11 - SISock: localhost/127.0.0.1:59999 - started
    [junit] SLOCK [T main @ 1409512231909 ms +++ localhost/127.0.0.1:59999 - Locked within 3006 ms, 4 attempts
    [junit] SLOCK [T main @ 1409512231909 ms --- localhost/127.0.0.1:59999 - Unlock ok within 0 ms
    [junit] Thread-13 - SISock: localhost/127.0.0.1:59999 - started
    [junit] SLOCK [T main @ 1409512231937 ms +++ localhost/127.0.0.1:59999 - Locked within 0 ms, 1 attempts
    [junit] Tests run: 1, Failures: 0, Errors: 0, Time elapsed: 3.009 sec
    [junit] ------------- Standard Error -----------------
    [junit] SLOCK [T main @ 1409512228903 ms III localhost/127.0.0.1:59999 - Wait for lock
    [junit] Thread-11 - SISock: localhost/127.0.0.1:59999 - started
    [junit] SLOCK [T main @ 1409512231909 ms +++ localhost/127.0.0.1:59999 - Locked within 3006 ms, 4 attempts
    [junit] SLOCK [T main @ 1409512231909 ms --- localhost/127.0.0.1:59999 - Unlock ok within 0 ms
    [junit] ------------- ---------------- ---------------
    [junit] 
    [junit] Testcase: testJVMShutdown took 3.007 sec
    [junit] Tests run: 1, Failures: 0, Errors: 0, Time elapsed: 3.009 sec
    [junit] 
    [junit] ------------- Standard Error -----------------
    [junit] SLOCK [T main @ 1409512228903 ms III localhost/127.0.0.1:59999 - Wait for lock
    [junit] Thread-11 - SISock: localhost/127.0.0.1:59999 - started
    [junit] SLOCK [T main @ 1409512231909 ms +++ localhost/127.0.0.1:59999 - Locked within 3006 ms, 4 attempts
    [junit] SLOCK [T main @ 1409512231909 ms --- localhost/127.0.0.1:59999 - Unlock ok within 0 ms
    [junit] ------------- ---------------- ---------------
    [junit] Testsuite: com.jogamp.common.util.locks.TestSingletonServerSocket02
    [junit] Testsuite: com.jogamp.common.util.locks.TestSingletonServerSocket02
    [junit] Tests run: 1, Failures: 0, Errors: 0, Time elapsed: 0.039 sec
    [junit] ------------- Standard Error -----------------
    [junit] Thread-13 - SISock: localhost/127.0.0.1:59999 - started
    [junit] SLOCK [T main @ 1409512231937 ms +++ localhost/127.0.0.1:59999 - Locked within 0 ms, 1 attempts
    [junit] SLOCK [T main @ 1409512231973 ms --- localhost/127.0.0.1:59999 - Unlock ok within 0 ms
    [junit] ------------- ---------------- ---------------
    [junit] 
    [junit] Testcase: dummy took 0 sec
    [junit] Tests run: 1, Failures: 0, Errors: 0, Time elapsed: 0.039 sec
    [junit] 
    [junit] ------------- Standard Error -----------------
    [junit] Thread-13 - SISock: localhost/127.0.0.1:59999 - started
    [junit] SLOCK [T main @ 1409512231937 ms +++ localhost/127.0.0.1:59999 - Locked within 0 ms, 1 attempts
    [junit] SLOCK [T main @ 1409512231973 ms --- localhost/127.0.0.1:59999 - Unlock ok within 0 ms
    [junit] ------------- ---------------- ---------------
    [junit] Testsuite: com.jogamp.gluegen.test.junit.generation.PCPPTest
    [junit] Testsuite: com.jogamp.gluegen.test.junit.generation.PCPPTest
    [junit]  - - - System info - - - 
    [junit] -----------------------------------------------------------------------------------------------------
    [junit] Platform: MACOS / Mac OS X 10.9.4 (10.9.4), x86_64 (arch), GENERIC_ABI, 2 cores
    [junit] MachineDescription: runtimeValidated true, littleEndian true, 32Bit false, primitive size / alignment:
    [junit]   int8    1 / 1, int16   2 / 2
    [junit]   int     4 / 4, long    8 / 8
    [junit]   int32   4 / 4, int64   8 / 8
    [junit]   float   4 / 4, double  8 / 8, ldouble 16 / 16
    [junit]   pointer 8 / 8, page    4096
    [junit] Platform: Java Version: 1.7.0_60 (1.7.0u60), VM: Java HotSpot(TM) 64-Bit Server VM, Runtime: Java(TM) SE Runtime Environment
    [junit] Platform: Java Vendor: Oracle Corporation, http://java.oracle.com/, JavaSE: true, Java6: true, AWT enabled: true
    [junit] -----------------------------------------------------------------------------------------------------
    [junit] VM: Java HotSpot(TM) 64-Bit Server VM
    [junit] rootrel.build: build
    [junit] gluegen.root: ..
    [junit] testOutput: ../build/test
    [junit]  - - - - - - - - - - - - 
    [junit] SLOCK [T main @ 1409512231973 ms --- localhost/127.0.0.1:59999 - Unlock ok within 0 ms
    [junit] ++++ TestCase.setUp: com.jogamp.gluegen.test.junit.generation.PCPPTest - pcppMacroDefinitionTest
    [junit] Aug 31, 2014 9:10:32 PM com.jogamp.gluegen.pcpp.PCPP handleWarning
    [junit] WARNING: #warning "Test warning with quotes - they must have quotes" at "pcpptest.h" line "128"
    [junit] Expected: 
    [junit] -------------------------------
    [junit] #1"pcpptest.h"#defineCL_SCHAR_MIN(-127-1)#define__YES__1#16"pcpptest.h"#26"pcpptest.h"#36"pcpptest.h"cl_charGOOD_A;intGOOD_B;intGOOD_C;#40"pcpptest.h"#54"pcpptest.h"intTEST_D_GOOD;#60"pcpptest.h"#70"pcpptest.h"#77"pcpptest.h"#105"pcpptest.h"#123"pcpptest.h"intGOOD_F_1;intGOOD_F_2;#126"pcpptest.h"intGOOD_G;#128"pcpptest.h"#130"pcpptest.h"#134"pcpptest.h"#136"pcpptest.h"
    [junit] -------------------------------
    [junit] 
    [junit] Result: 
    [junit] -------------------------------
    [junit] #1"pcpptest.h"#defineCL_SCHAR_MIN(-127-1)#define__YES__1#16"pcpptest.h"#26"pcpptest.h"#36"pcpptest.h"cl_charGOOD_A;intGOOD_B;intGOOD_C;#40"pcpptest.h"#54"pcpptest.h"intTEST_D_GOOD;#60"pcpptest.h"#70"pcpptest.h"#77"pcpptest.h"#105"pcpptest.h"#123"pcpptest.h"intGOOD_F_1;intGOOD_F_2;#126"pcpptest.h"intGOOD_G;#128"pcpptest.h"#130"pcpptest.h"#134"pcpptest.h"#136"pcpptest.h"
    [junit] -------------------------------
    [junit] 
    [junit] ++++ TestCase.tearDown: com.jogamp.gluegen.test.junit.generation.PCPPTest - pcppMacroDefinitionTest
    [junit] Tests run: 1, Failures: 0, Errors: 0, Time elapsed: 0.105 sec
    [junit] ------------- Standard Output ---------------
    [junit]  - - - System info - - - 
    [junit] -----------------------------------------------------------------------------------------------------
    [junit] Platform: MACOS / Mac OS X 10.9.4 (10.9.4), x86_64 (arch), GENERIC_ABI, 2 cores
    [junit] MachineDescription: runtimeValidated true, littleEndian true, 32Bit false, primitive size / alignment:
    [junit]   int8    1 / 1, int16   2 / 2
    [junit]   int     4 / 4, long    8 / 8
    [junit]   int32   4 / 4, int64   8 / 8
    [junit]   float   4 / 4, double  8 / 8, ldouble 16 / 16
    [junit]   pointer 8 / 8, page    4096
    [junit] Platform: Java Version: 1.7.0_60 (1.7.0u60), VM: Java HotSpot(TM) 64-Bit Server VM, Runtime: Java(TM) SE Runtime Environment
    [junit] Platform: Java Vendor: Oracle Corporation, http://java.oracle.com/, JavaSE: true, Java6: true, AWT enabled: true
    [junit] -----------------------------------------------------------------------------------------------------
    [junit] VM: Java HotSpot(TM) 64-Bit Server VM
    [junit] rootrel.build: build
    [junit] gluegen.root: ..
    [junit] testOutput: ../build/test
    [junit]  - - - - - - - - - - - - 
    [junit] ------------- ---------------- ---------------
    [junit] ------------- Standard Error -----------------
    [junit] ++++ TestCase.setUp: com.jogamp.gluegen.test.junit.generation.PCPPTest - pcppMacroDefinitionTest
    [junit] Aug 31, 2014 9:10:32 PM com.jogamp.gluegen.pcpp.PCPP handleWarning
    [junit] WARNING: #warning "Test warning with quotes - they must have quotes" at "pcpptest.h" line "128"
    [junit] Expected: 
    [junit] -------------------------------
    [junit] #1"pcpptest.h"#defineCL_SCHAR_MIN(-127-1)#define__YES__1#16"pcpptest.h"#26"pcpptest.h"#36"pcpptest.h"cl_charGOOD_A;intGOOD_B;intGOOD_C;#40"pcpptest.h"#54"pcpptest.h"intTEST_D_GOOD;#60"pcpptest.h"#70"pcpptest.h"#77"pcpptest.h"#105"pcpptest.h"#123"pcpptest.h"intGOOD_F_1;intGOOD_F_2;#126"pcpptest.h"intGOOD_G;#128"pcpptest.h"#130"pcpptest.h"#134"pcpptest.h"#136"pcpptest.h"
    [junit] -------------------------------
    [junit] 
    [junit] Result: 
    [junit] -------------------------------
    [junit] #1"pcpptest.h"#defineCL_SCHAR_MIN(-127-1)#define__YES__1#16"pcpptest.h"#26"pcpptest.h"#36"pcpptest.h"cl_charGOOD_A;intGOOD_B;intGOOD_C;#40"pcpptest.h"#54"pcpptest.h"intTEST_D_GOOD;#60"pcpptest.h"#70"pcpptest.h"#77"pcpptest.h"#105"pcpptest.h"#123"pcpptest.h"intGOOD_F_1;intGOOD_F_2;#126"pcpptest.h"intGOOD_G;#128"pcpptest.h"#130"pcpptest.h"#134"pcpptest.h"#136"pcpptest.h"
    [junit] -------------------------------
    [junit] 
    [junit] ++++ TestCase.tearDown: com.jogamp.gluegen.test.junit.generation.PCPPTest - pcppMacroDefinitionTest
    [junit] ------------- ---------------- ---------------
    [junit] 
    [junit] Testcase: pcppMacroDefinitionTest took 0.045 sec
    [junit] Tests run: 1, Failures: 0, Errors: 0, Time elapsed: 0.105 sec
    [junit] 
    [junit] ------------- Standard Output ---------------
    [junit]  - - - System info - - - 
    [junit] -----------------------------------------------------------------------------------------------------
    [junit] Platform: MACOS / Mac OS X 10.9.4 (10.9.4), x86_64 (arch), GENERIC_ABI, 2 cores
    [junit] MachineDescription: runtimeValidated true, littleEndian true, 32Bit false, primitive size / alignment:
    [junit]   int8    1 / 1, int16   2 / 2
    [junit]   int     4 / 4, long    8 / 8
    [junit]   int32   4 / 4, int64   8 / 8
    [junit]   float   4 / 4, double  8 / 8, ldouble 16 / 16
    [junit]   pointer 8 / 8, page    4096
    [junit] Platform: Java Version: 1.7.0_60 (1.7.0u60), VM: Java HotSpot(TM) 64-Bit Server VM, Runtime: Java(TM) SE Runtime Environment
    [junit] Platform: Java Vendor: Oracle Corporation, http://java.oracle.com/, JavaSE: true, Java6: true, AWT enabled: true
    [junit] -----------------------------------------------------------------------------------------------------
    [junit] VM: Java HotSpot(TM) 64-Bit Server VM
    [junit] rootrel.build: build
    [junit] gluegen.root: ..
    [junit] testOutput: ../build/test
    [junit]  - - - - - - - - - - - - 
    [junit] ------------- ---------------- ---------------
    [junit] ------------- Standard Error -----------------
    [junit] ++++ TestCase.setUp: com.jogamp.gluegen.test.junit.generation.PCPPTest - pcppMacroDefinitionTest
    [junit] Aug 31, 2014 9:10:32 PM com.jogamp.gluegen.pcpp.PCPP handleWarning
    [junit] WARNING: #warning "Test warning with quotes - they must have quotes" at "pcpptest.h" line "128"
    [junit] Expected: 
    [junit] -------------------------------
    [junit] #1"pcpptest.h"#defineCL_SCHAR_MIN(-127-1)#define__YES__1#16"pcpptest.h"#26"pcpptest.h"#36"pcpptest.h"cl_charGOOD_A;intGOOD_B;intGOOD_C;#40"pcpptest.h"#54"pcpptest.h"intTEST_D_GOOD;#60"pcpptest.h"#70"pcpptest.h"#77"pcpptest.h"#105"pcpptest.h"#123"pcpptest.h"intGOOD_F_1;intGOOD_F_2;#126"pcpptest.h"intGOOD_G;#128"pcpptest.h"#130"pcpptest.h"#134"pcpptest.h"#136"pcpptest.h"
    [junit] -------------------------------
    [junit] 
    [junit] Result: 
    [junit] -------------------------------
    [junit] #1"pcpptest.h"#defineCL_SCHAR_MIN(-127-1)#define__YES__1#16"pcpptest.h"#26"pcpptest.h"#36"pcpptest.h"cl_charGOOD_A;intGOOD_B;intGOOD_C;#40"pcpptest.h"#54"pcpptest.h"intTEST_D_GOOD;#60"pcpptest.h"#70"pcpptest.h"#77"pcpptest.h"#105"pcpptest.h"#123"pcpptest.h"intGOOD_F_1;intGOOD_F_2;#126"pcpptest.h"intGOOD_G;#128"pcpptest.h"#130"pcpptest.h"#134"pcpptest.h"#136"pcpptest.h"
    [junit] -------------------------------
    [junit] 
    [junit] ++++ TestCase.tearDown: com.jogamp.gluegen.test.junit.generation.PCPPTest - pcppMacroDefinitionTest
    [junit] ------------- ---------------- ---------------
    [junit] Testsuite: com.jogamp.gluegen.test.junit.generation.Test1p1JavaEmitter
    [junit] Testsuite: com.jogamp.gluegen.test.junit.generation.Test1p1JavaEmitter
    [junit] ++++ TestCase.setUp: com.jogamp.gluegen.test.junit.generation.Test1p1JavaEmitter - chapter02TestClassExist
    [junit] ++++ TestCase.tearDown: com.jogamp.gluegen.test.junit.generation.Test1p1JavaEmitter - chapter02TestClassExist
    [junit] ++++ TestCase.setUp: com.jogamp.gluegen.test.junit.generation.Test1p1JavaEmitter - chapter03aTestCoverageFunctionalityDirectNIOAndPrimitiveArray
    [junit] Testing accessing PointerBuffer values [0..7]
    [junit]   0/8: 0x7fc249dd1c30
    [junit]   1/8: 0x7fc249dd1c70
    [junit]   2/8: 0x7fc249dd1cb0
    [junit]   3/8: 0x7fc249dd1cf0
    [junit]   4/8: 0x7fc249dd1d30
    [junit]   5/8: 0x7fc249dd1d70
    [junit]   6/8: 0x7fc249dd1db0
    [junit]   7/8: 0x7fc249dd1df0
    [junit] Testing accessing PointerBuffer values [0..7]
    [junit]   0/8: 0x7fc249dd1c30
    [junit]   1/8: 0x7fc249dd1c70
    [junit]   2/8: 0x7fc249dd1cb0
    [junit]   3/8: 0x7fc249dd1cf0
    [junit]   4/8: 0x7fc249dd1d30
    [junit]   5/8: 0x7fc249dd1d70
    [junit]   6/8: 0x7fc249dd1db0
    [junit]   7/8: 0x7fc249dd1df0
    [junit] Testing accessing PointerBuffer values [0..7]
    [junit]   0/8: 0x7fc249cc0940
    [junit]   1/8: 0x7fc249ca4380
    [junit]   2/8: 0x7fc249ca43c0
    [junit]   3/8: 0x7fc249ca4400
    [junit]   4/8: 0x7fc249ca4440
    [junit]   5/8: 0x7fc249cacd50
    [junit]   6/8: 0x7fc249cacd90
    [junit]   7/8: 0x7fc249cacdd0
    [junit] Testing accessing PointerBuffer values [0..7]
    [junit]   0/8: 0x7fc249cc0940
    [junit]   1/8: 0x7fc249ca4380
    [junit]   2/8: 0x7fc249ca43c0
    [junit]   3/8: 0x7fc249ca4400
    [junit]   4/8: 0x7fc249ca4440
    [junit]   5/8: 0x7fc249cacd50
    [junit]   6/8: 0x7fc249cacd90
    [junit]   7/8: 0x7fc249cacdd0
    [junit] Testing accessing PointerBuffer values [0..7]
    [junit]   0/8: 0x7fc249c722f0
    [junit]   1/8: 0x7fc249c72330
    [junit]   2/8: 0x7fc249c72370
    [junit]   3/8: 0x7fc249c723b0
    [junit]   4/8: 0x7fc249cfae90
    [junit]   5/8: 0x7fc249cfaed0
    [junit]   6/8: 0x7fc249cfaf10
    [junit]   7/8: 0x7fc249cfaf50
    [junit] Testing accessing PointerBuffer values [0..7]
    [junit]   0/8: 0x7fc249cc0980
    [junit]   1/8: 0x7fc249c8d6e0
    [junit]   2/8: 0x7fc249c8d720
    [junit]   3/8: 0x7fc249c8ea40
    [junit]   4/8: 0x7fc249c8ea80
    [junit]   5/8: 0x7fc249c8eac0
    [junit]   6/8: 0x7fc249cf4c20
    [junit]   7/8: 0x7fc249cf4c60
    [junit] Testing accessing PointerBuffer values [0..7]
    [junit]   0/8: 0x7fc249cc0980
    [junit]   1/8: 0x7fc249c8d6e0
    [junit]   2/8: 0x7fc249c8d720
    [junit]   3/8: 0x7fc249c8ea40
    [junit]   4/8: 0x7fc249c8ea80
    [junit]   5/8: 0x7fc249c8eac0
    [junit]   6/8: 0x7fc249cf4c20
    [junit]   7/8: 0x7fc249cf4c60
    [junit] Testing accessing PointerBuffer values [0..7]
    [junit]   0/8: 0x7fc249de5f20
    [junit]   1/8: 0x7fc249de5f20
    [junit]   2/8: 0x7fc249de5f20
    [junit]   3/8: 0x7fc249de5f20
    [junit]   4/8: 0x7fc249de5f20
    [junit]   5/8: 0x7fc249de5f20
    [junit]   6/8: 0x7fc249de5f20
    [junit]   7/8: 0x7fc249de5f20
    [junit] Testing accessing PointerBuffer values [0..7]
    [junit]   0/8: 0x4
    [junit]   1/8: 0x4
    [junit]   2/8: 0x4
    [junit]   3/8: 0x4
    [junit]   4/8: 0x4
    [junit]   5/8: 0x4
    [junit]   6/8: 0x4
    [junit]   7/8: 0x4
    [junit] ++++ TestCase.tearDown: com.jogamp.gluegen.test.junit.generation.Test1p1JavaEmitter - chapter03aTestCoverageFunctionalityDirectNIOAndPrimitiveArray
    [junit] ++++ TestCase.setUp: com.jogamp.gluegen.test.junit.generation.Test1p1JavaEmitter - chapter03bTestCoverageFunctionalityIndirectNIOAndPrimitiveArray
    [junit] Testing accessing PointerBuffer values [0..7]
    [junit]   0/8: 0x11f9931e8
    [junit]   1/8: 0x11f993228
    [junit]   2/8: 0x11f993268
    [junit]   3/8: 0x11f9932a8
    [junit]   4/8: 0x11f9932e8
    [junit]   5/8: 0x11f993328
    [junit]   6/8: 0x11f993368
    [junit]   7/8: 0x11f9933a8
    [junit] Testing accessing PointerBuffer values [0..7]
    [junit]   0/8: 0x11f9931e8
    [junit]   1/8: 0x11f993228
    [junit]   2/8: 0x11f993268
    [junit]   3/8: 0x11f9932a8
    [junit]   4/8: 0x11f9932e8
    [junit]   5/8: 0x11f993328
    [junit]   6/8: 0x11f993368
    [junit]   7/8: 0x11f9933a8
    [junit] Testing accessing PointerBuffer values [0..7]
    [junit]   0/8: 0x7fc24c01fd80
    [junit]   1/8: 0x7fc249d552b0
    [junit]   2/8: 0x7fc249d552f0
    [junit]   3/8: 0x7fc249d55330
    [junit]   4/8: 0x7fc24c01aa40
    [junit]   5/8: 0x7fc24c01aa80
    [junit]   6/8: 0x7fc24c01aac0
    [junit]   7/8: 0x7fc249d64990
    [junit] Testing accessing PointerBuffer values [0..7]
    [junit]   0/8: 0x7fc24c01fd80
    [junit]   1/8: 0x7fc249d552b0
    [junit]   2/8: 0x7fc249d552f0
    [junit]   3/8: 0x7fc249d55330
    [junit]   4/8: 0x7fc24c01aa40
    [junit]   5/8: 0x7fc24c01aa80
    [junit]   6/8: 0x7fc24c01aac0
    [junit]   7/8: 0x7fc249d64990
    [junit] Testing accessing PointerBuffer values [0..7]
    [junit]   0/8: 0x7fc249d649d0
    [junit]   1/8: 0x7fc249d64a10
    [junit]   2/8: 0x7fc24c020f00
    [junit]   3/8: 0x7fc24c020f40
    [junit]   4/8: 0x7fc24c020f80
    [junit]   5/8: 0x7fc24c00afc0
    [junit]   6/8: 0x7fc24c00b000
    [junit]   7/8: 0x7fc24c00b040
    [junit] Testing accessing PointerBuffer values [0..7]
    [junit]   0/8: 0x7fc249da2230
    [junit]   1/8: 0x7fc249da2270
    [junit]   2/8: 0x7fc249da22b0
    [junit]   3/8: 0x7fc24c00ca90
    [junit]   4/8: 0x7fc24c00cad0
    [junit]   5/8: 0x7fc24c00cb10
    [junit]   6/8: 0x7fc24c027e60
    [junit]   7/8: 0x7fc24c027ea0
    [junit] Testing accessing PointerBuffer values [0..7]
    [junit]   0/8: 0x7fc249da2230
    [junit]   1/8: 0x7fc249da2270
    [junit]   2/8: 0x7fc249da22b0
    [junit]   3/8: 0x7fc24c00ca90
    [junit]   4/8: 0x7fc24c00cad0
    [junit]   5/8: 0x7fc24c00cb10
    [junit]   6/8: 0x7fc24c027e60
    [junit]   7/8: 0x7fc24c027ea0
    [junit] Testing accessing PointerBuffer values [0..7]
    [junit]   0/8: 0x7fc249d5b010
    [junit]   1/8: 0x7fc249d5b010
    [junit]   2/8: 0x7fc249d5b010
    [junit]   3/8: 0x7fc249d5b010
    [junit]   4/8: 0x7fc249d5b010
    [junit]   5/8: 0x7fc249d5b010
    [junit]   6/8: 0x7fc249d5b010
    [junit]   7/8: 0x7fc249d5b010
    [junit] Testing accessing PointerBuffer values [0..7]
    [junit]   0/8: 0x4
    [junit]   1/8: 0x4
    [junit]   2/8: 0x4
    [junit]   3/8: 0x4
    [junit]   4/8: 0x4
    [junit]   5/8: 0x4
    [junit]   6/8: 0x4
    [junit]   7/8: 0x4
    [junit] ++++ TestCase.tearDown: com.jogamp.gluegen.test.junit.generation.Test1p1JavaEmitter - chapter03bTestCoverageFunctionalityIndirectNIOAndPrimitiveArray
    [junit] ++++ TestCase.setUp: com.jogamp.gluegen.test.junit.generation.Test1p1JavaEmitter - chapter04TestPointerBuffer
    [junit] Testing accessing PointerBuffer values [0..0]
    [junit]   0/1: 0xdeadbeef
    [junit] Testing accessing PointerBuffer values [0..0]
    [junit]   0/1: 0xdeadbeef
    [junit] Testing accessing PointerBuffer values [0..0]
    [junit]   0/1: 0xdeadbeef
    [junit] Testing accessing PointerBuffer values [0..0]
    [junit]   0/1: 0xdeadbeef
    [junit] Testing accessing PointerBuffer values [0..0]
    [junit]   0/1: 0xdeadbeef
    [junit] Testing accessing PointerBuffer values [0..0]
    [junit]   0/1: 0xdeadbeef
    [junit] Testing accessing PointerBuffer values [0..0]
    [junit]   0/1: 0xdeadbeef
    [junit] Testing accessing PointerBuffer values [0..0]
    [junit]   0/1: 0xdeadbeef
    [junit] ++++ TestCase.tearDown: com.jogamp.gluegen.test.junit.generation.Test1p1JavaEmitter - chapter04TestPointerBuffer
    [junit] ++++ TestCase.setUp: com.jogamp.gluegen.test.junit.generation.Test1p1JavaEmitter - chapter05TestSomeFunctionsAllIndirect
    [junit] ArrayCopy.01: [1, 2, 3, 4, 5, 6, 7, 8, 9, 0]
    [junit] ArrayCopy.02: [1, 2, 3, 4, 5, 6, 7, 8, 9, 0], java.nio.HeapIntBuffer[pos=0 lim=10 cap=10]
    [junit] ArrayCopy.03: [4, 5, 6, 7]
    [junit] ArrayCopy.04: [0, 0, 0, 4, 5, 6, 7, 0, 0, 0]
    [junit] ArrayCopy.05: [0, 0, 0, 4, 5, 6, 7, 0, 0, 0], java.nio.HeapIntBuffer[pos=0 lim=10 cap=10]
    [junit] ++++ TestCase.tearDown: com.jogamp.gluegen.test.junit.generation.Test1p1JavaEmitter - chapter05TestSomeFunctionsAllIndirect
    [junit] ++++ TestCase.setUp: com.jogamp.gluegen.test.junit.generation.Test1p1JavaEmitter - chapter09TestCompoundAlignment
    [junit] static  md: MachineDescriptionStatic: X86_64_UNIX(2): MachineDescription: runtimeValidated false, littleEndian true, 32Bit false, primitive size / alignment:
    [junit]   int8    1 / 1, int16   2 / 2
    [junit]   int     4 / 4, long    8 / 8
    [junit]   int32   4 / 4, int64   8 / 8
    [junit]   float   4 / 4, double  8 / 8, ldouble 16 / 16
    [junit]   pointer 8 / 8, page    4096
    [junit] runtime md: MachineDescription: runtimeValidated true, littleEndian true, 32Bit false, primitive size / alignment:
    [junit]   int8    1 / 1, int16   2 / 2
    [junit]   int     4 / 4, long    8 / 8
    [junit]   int32   4 / 4, int64   8 / 8
    [junit]   float   4 / 4, double  8 / 8, ldouble 16 / 16
    [junit]   pointer 8 / 8, page    4096
    [junit] compatible static/runtime: true
    [junit] TK_ComplicatedSubSet: sizeof(): 72
    [junit] TK_ComplicatedSubSet: bits1-s offset: 0
    [junit] TK_ComplicatedSubSet:    id-s offset: 4
    [junit] TK_ComplicatedSubSet: bits2-s offset: 8
    [junit] TK_ComplicatedSubSet: long0-s offset: 16
    [junit] TK_ComplicatedSubSet: bits3-s offset: 24
    [junit] TK_ComplicatedSubSet: real0-s offset: 32
    [junit] TK_ComplicatedSubSet: bits4-s offset: 40
    [junit] TK_ComplicatedSubSet: real1-s offset: 44
    [junit] TK_ComplicatedSubSet: bits5-s offset: 48
    [junit] TK_ComplicatedSubSet: longX-s offset: 56
    [junit] TK_ComplicatedSubSet: bits6-s offset: 64
    [junit] TK_ComplicatedSuperSet: sizeof(): 168
    [junit] TK_ComplicatedSuperSet: bits1-s offset: 0
    [junit] TK_ComplicatedSuperSet:  sub1-s offset: 8
    [junit] TK_ComplicatedSuperSet: bits2-s offset: 80
    [junit] TK_ComplicatedSuperSet:  sub2-s offset: 88
    [junit] TK_ComplicatedSuperSet: bits3-s offset: 160
    [junit] createComplicatedSuperSet:
    [junit] TK_ComplicatedSuperSet [
    [junit]   cs.b1         0xA0
    [junit]   cs.sub1.b1    0xA1
    [junit]   cs.sub1.id    0x12345678
    [junit]   cs.sub1.b2    0xA2
    [junit]   cs.sub1.long0 0x123456789ABCDEF0
    [junit]   cs.sub1.b3    0xA3
    [junit]   cs.sub1.real0 3.14159 0X1.921FB54442D18P+1
    [junit]   cs.sub1.b4    0xA4
    [junit]   cs.sub1.real1 256.123 0X1.001F9AP+8
    [junit]   cs.sub1.b5    0xA5
    [junit]   cs.sub1.longX 0xDEADBEEF
    [junit]   cs.sub1.b6    0xA6
    [junit]   cs.b2         0xB0
    [junit]   cs.sub2.b1    0xB1
    [junit]   cs.sub2.id    0x12345678
    [junit]   cs.sub2.b2    0xB2
    [junit]   cs.sub2.long0 0x123456789ABCDEF0
    [junit]   cs.sub2.b3    0xB3
    [junit]   cs.sub2.real0 3.14159 0X1.921FB54442D18P+1
    [junit]   cs.sub2.b4    0xB4
    [junit]   cs.sub2.real1 256.123 0X1.001F9AP+8
    [junit]   cs.sub2.b5    0xB5
    [junit]   cs.sub2.longX 0xDEADBEEF
    [junit]   cs.sub2.b6    0xB6
    [junit]   cs.b3         0xC0
    [junit] ]
    [junit] 
    [junit] hasInitValues res 1:
    [junit] TK_ComplicatedSuperSet [
    [junit]   cs.b1         0xA0
    [junit]   cs.sub1.b1    0xA1
    [junit]   cs.sub1.id    0x12345678
    [junit]   cs.sub1.b2    0xA2
    [junit]   cs.sub1.long0 0x123456789ABCDEF0
    [junit]   cs.sub1.b3    0xA3
    [junit]   cs.sub1.real0 3.14159 0X1.921FB54442D18P+1
    [junit]   cs.sub1.b4    0xA4
    [junit]   cs.sub1.real1 256.123 0X1.001F9AP+8
    [junit]   cs.sub1.b5    0xA5
    [junit]   cs.sub1.longX 0xDEADBEEF
    [junit]   cs.sub1.b6    0xA6
    [junit]   cs.b2         0xB0
    [junit]   cs.sub2.b1    0xB1
    [junit]   cs.sub2.id    0x12345678
    [junit]   cs.sub2.b2    0xB2
    [junit]   cs.sub2.long0 0x123456789ABCDEF0
    [junit]   cs.sub2.b3    0xB3
    [junit]   cs.sub2.real0 3.14159 0X1.921FB54442D18P+1
    [junit]   cs.sub2.b4    0xB4
    [junit]   cs.sub2.real1 256.123 0X1.001F9AP+8
    [junit]   cs.sub2.b5    0xB5
    [junit]   cs.sub2.longX 0xDEADBEEF
    [junit]   cs.sub2.b6    0xB6
    [junit]   cs.b3         0xC0
    [junit] ]
    [junit] 
    [junit] ++++ TestCase.tearDown: com.jogamp.gluegen.test.junit.generation.Test1p1JavaEmitter - chapter09TestCompoundAlignment
    [junit] ++++ TestCase.setUp: com.jogamp.gluegen.test.junit.generation.Test1p1JavaEmitter - chapter10TestCompoundCallByReference
    [junit] 0x123456789abcdef0 == 0x123456789abcdef0
    [junit] 0xa23456781abcdef0 == 0xa23456781abcdef0
    [junit] 0xb23456782abcdef0 == 0xb23456782abcdef0
    [junit] 0x123456789abcdef0 == 0x123456789abcdef0
    [junit] 0xa23456781abcdef0 == 0xa23456781abcdef0
    [junit] 0xb23456782abcdef0 == 0xb23456782abcdef0
    [junit] 0x123456789abcdef0 == 0x123456789abcdef0
    [junit] 0xa23456781abcdef0 == 0xa23456781abcdef0
    [junit] 0xb23456782abcdef0 == 0xb23456782abcdef0
    [junit] 0x123456789abcdef0 == 0x123456789abcdef0
    [junit] 0xa23456781abcdef0 == 0xa23456781abcdef0
    [junit] 0xb23456782abcdef0 == 0xb23456782abcdef0
    [junit] ch10: ref-dim 286331153/572662306 858993459x1145324612
    [junit] ++++ TestCase.tearDown: com.jogamp.gluegen.test.junit.generation.Test1p1JavaEmitter - chapter10TestCompoundCallByReference
    [junit] ++++ TestCase.setUp: com.jogamp.gluegen.test.junit.generation.Test1p1JavaEmitter - chapter11TestCompoundCallByValue
    [junit] ch11.0: ref-dim 286331153/572662306 858993459x1145324612
    [junit] XXX.getSurfaceBoundsValue: dim 286331153/572662306 858993459x1145324612
    [junit] ch11.0: val-dim 286331153/572662306 858993459x1145324612
    [junit] ch11.1: val-dim 11/22 33x44
    [junit] XXX.getSurfaceBoundsValue: dim 11/22 33x44
    [junit] ch11.2: val-dim 11/22 33x44
    [junit] ch11.3: sameInstanceByVal false
    [junit] ch11.3: sameInstanceByRef false
    [junit] ch11.4: sum-dimArray 12/24 36x48
    [junit] ch11.5: dimsGet[0] 11/22 33x44
    [junit] ch11.5: dimsGet[1] 1/2 3x4
    [junit] ch11.6: sum-dimPair 12/24 36x48
    [junit] ch11.7: zero-dim[0] 0/0 0x0
    [junit] ch11.7: zero-dim[1] 0/0 0x0
    [junit] ch11.8: copyPrim2Dim 11/22 100x200
    [junit] ch11.9: copyDim2Prim 11/22 100x200
    [junit] ch11.10: expRGBAb 0x11, 0x22, 0x33, 0xffffffaa
    [junit] ch11.10: hasRGBAi 0x112233aa
    [junit] ch11.11: hasRGBAb 0x11, 0x22, 0x33, 0xffffffaa
    [junit] ch11.12: addInt 3
    [junit] ch11.13: addByte 3
    [junit] ++++ TestCase.tearDown: com.jogamp.gluegen.test.junit.generation.Test1p1JavaEmitter - chapter11TestCompoundCallByValue
    [junit] ++++ TestCase.setUp: com.jogamp.gluegen.test.junit.generation.Test1p1JavaEmitter - chapter12TestStructArrayModelConst
    [junit] 0x123456789abcdef0 == 0x123456789abcdef0
    [junit] 0x123456789abcdef0 == 0x123456789abcdef0
    [junit] has 'Hello Array'
    [junit] has   0: 0x48 H
    [junit] has   1: 0x65 e
    [junit] has   2: 0x6C l
    [junit] has   3: 0x6C l
    [junit] has   4: 0x6F o
    [junit] has   5: 0x20  
    [junit] has   6: 0x41 A
    [junit] has   7: 0x72 r
    [junit] has   8: 0x72 r
    [junit] has   9: 0x61 a
    [junit] has  10: 0x79 y
    [junit] has 'Hello CString'
    [junit] has   0: 0x48 H
    [junit] has   1: 0x65 e
    [junit] has   2: 0x6C l
    [junit] has   3: 0x6C l
    [junit] has   4: 0x6F o
    [junit] has   5: 0x20  
    [junit] has   6: 0x43 C
    [junit] has   7: 0x53 S
    [junit] has   8: 0x74 t
    [junit] has   9: 0x72 r
    [junit] has  10: 0x69 i
    [junit] has  11: 0x6E n
    [junit] has  12: 0x67 g
    [junit] has 'Hello Pointer'
    [junit] has   0: 0x48 H
    [junit] has   1: 0x65 e
    [junit] has   2: 0x6C l
    [junit] has   3: 0x6C l
    [junit] has   4: 0x6F o
    [junit] has   5: 0x20  
    [junit] has   6: 0x50 P
    [junit] has   7: 0x6F o
    [junit] has   8: 0x69 i
    [junit] has   9: 0x6E n
    [junit] has  10: 0x74 t
    [junit] has  11: 0x65 e
    [junit] has  12: 0x72 r
    [junit] ++++ TestCase.tearDown: com.jogamp.gluegen.test.junit.generation.Test1p1JavaEmitter - chapter12TestStructArrayModelConst
    [junit] ++++ TestCase.setUp: com.jogamp.gluegen.test.junit.generation.Test1p1JavaEmitter - chapter13TestStructArrayModelMutable
    [junit] 0x123456789abcdef0 == 0x123456789abcdef0
    [junit] 0x123456789abcdef0 == 0x123456789abcdef0
    [junit] ++++ TestCase.tearDown: com.jogamp.gluegen.test.junit.generation.Test1p1JavaEmitter - chapter13TestStructArrayModelMutable
    [junit] Tests run: 10, Failures: 0, Errors: 0, Time elapsed: 0.179 sec
    [junit] ------------- Standard Error -----------------
    [junit] ++++ TestCase.setUp: com.jogamp.gluegen.test.junit.generation.Test1p1JavaEmitter - chapter02TestClassExist
    [junit] ++++ TestCase.tearDown: com.jogamp.gluegen.test.junit.generation.Test1p1JavaEmitter - chapter02TestClassExist
    [junit] ++++ TestCase.setUp: com.jogamp.gluegen.test.junit.generation.Test1p1JavaEmitter - chapter03aTestCoverageFunctionalityDirectNIOAndPrimitiveArray
    [junit] Testing accessing PointerBuffer values [0..7]
    [junit]   0/8: 0x7fc249dd1c30
    [junit]   1/8: 0x7fc249dd1c70
    [junit]   2/8: 0x7fc249dd1cb0
    [junit]   3/8: 0x7fc249dd1cf0
    [junit]   4/8: 0x7fc249dd1d30
    [junit]   5/8: 0x7fc249dd1d70
    [junit]   6/8: 0x7fc249dd1db0
    [junit]   7/8: 0x7fc249dd1df0
    [junit] Testing accessing PointerBuffer values [0..7]
    [junit]   0/8: 0x7fc249dd1c30
    [junit]   1/8: 0x7fc249dd1c70
    [junit]   2/8: 0x7fc249dd1cb0
    [junit]   3/8: 0x7fc249dd1cf0
    [junit]   4/8: 0x7fc249dd1d30
    [junit]   5/8: 0x7fc249dd1d70
    [junit]   6/8: 0x7fc249dd1db0
    [junit]   7/8: 0x7fc249dd1df0
    [junit] Testing accessing PointerBuffer values [0..7]
    [junit]   0/8: 0x7fc249cc0940
    [junit]   1/8: 0x7fc249ca4380
    [junit]   2/8: 0x7fc249ca43c0
    [junit]   3/8: 0x7fc249ca4400
    [junit]   4/8: 0x7fc249ca4440
    [junit]   5/8: 0x7fc249cacd50
    [junit]   6/8: 0x7fc249cacd90
    [junit]   7/8: 0x7fc249cacdd0
    [junit] Testing accessing PointerBuffer values [0..7]
    [junit]   0/8: 0x7fc249cc0940
    [junit]   1/8: 0x7fc249ca4380
    [junit]   2/8: 0x7fc249ca43c0
    [junit]   3/8: 0x7fc249ca4400
    [junit]   4/8: 0x7fc249ca4440
    [junit]   5/8: 0x7fc249cacd50
    [junit]   6/8: 0x7fc249cacd90
    [junit]   7/8: 0x7fc249cacdd0
    [junit] Testing accessing PointerBuffer values [0..7]
    [junit]   0/8: 0x7fc249c722f0
    [junit]   1/8: 0x7fc249c72330
    [junit]   2/8: 0x7fc249c72370
    [junit]   3/8: 0x7fc249c723b0
    [junit]   4/8: 0x7fc249cfae90
    [junit]   5/8: 0x7fc249cfaed0
    [junit]   6/8: 0x7fc249cfaf10
    [junit]   7/8: 0x7fc249cfaf50
    [junit] Testing accessing PointerBuffer values [0..7]
    [junit]   0/8: 0x7fc249cc0980
    [junit]   1/8: 0x7fc249c8d6e0
    [junit]   2/8: 0x7fc249c8d720
    [junit]   3/8: 0x7fc249c8ea40
    [junit]   4/8: 0x7fc249c8ea80
    [junit]   5/8: 0x7fc249c8eac0
    [junit]   6/8: 0x7fc249cf4c20
    [junit]   7/8: 0x7fc249cf4c60
    [junit] Testing accessing PointerBuffer values [0..7]
    [junit]   0/8: 0x7fc249cc0980
    [junit]   1/8: 0x7fc249c8d6e0
    [junit]   2/8: 0x7fc249c8d720
    [junit]   3/8: 0x7fc249c8ea40
    [junit]   4/8: 0x7fc249c8ea80
    [junit]   5/8: 0x7fc249c8eac0
    [junit]   6/8: 0x7fc249cf4c20
    [junit]   7/8: 0x7fc249cf4c60
    [junit] Testing accessing PointerBuffer values [0..7]
    [junit]   0/8: 0x7fc249de5f20
    [junit]   1/8: 0x7fc249de5f20
    [junit]   2/8: 0x7fc249de5f20
    [junit]   3/8: 0x7fc249de5f20
    [junit]   4/8: 0x7fc249de5f20
    [junit]   5/8: 0x7fc249de5f20
    [junit]   6/8: 0x7fc249de5f20
    [junit]   7/8: 0x7fc249de5f20
    [junit] Testing accessing PointerBuffer values [0..7]
    [junit]   0/8: 0x4
    [junit]   1/8: 0x4
    [junit]   2/8: 0x4
    [junit]   3/8: 0x4
    [junit]   4/8: 0x4
    [junit]   5/8: 0x4
    [junit]   6/8: 0x4
    [junit]   7/8: 0x4
    [junit] ++++ TestCase.tearDown: com.jogamp.gluegen.test.junit.generation.Test1p1JavaEmitter - chapter03aTestCoverageFunctionalityDirectNIOAndPrimitiveArray
    [junit] ++++ TestCase.setUp: com.jogamp.gluegen.test.junit.generation.Test1p1JavaEmitter - chapter03bTestCoverageFunctionalityIndirectNIOAndPrimitiveArray
    [junit] Testing accessing PointerBuffer values [0..7]
    [junit]   0/8: 0x11f9931e8
    [junit]   1/8: 0x11f993228
    [junit]   2/8: 0x11f993268
    [junit]   3/8: 0x11f9932a8
    [junit]   4/8: 0x11f9932e8
    [junit]   5/8: 0x11f993328
    [junit]   6/8: 0x11f993368
    [junit]   7/8: 0x11f9933a8
    [junit] Testing accessing PointerBuffer values [0..7]
    [junit]   0/8: 0x11f9931e8
    [junit]   1/8: 0x11f993228
    [junit]   2/8: 0x11f993268
    [junit]   3/8: 0x11f9932a8
    [junit]   4/8: 0x11f9932e8
    [junit]   5/8: 0x11f993328
    [junit]   6/8: 0x11f993368
    [junit]   7/8: 0x11f9933a8
    [junit] Testing accessing PointerBuffer values [0..7]
    [junit]   0/8: 0x7fc24c01fd80
    [junit]   1/8: 0x7fc249d552b0
    [junit]   2/8: 0x7fc249d552f0
    [junit]   3/8: 0x7fc249d55330
    [junit]   4/8: 0x7fc24c01aa40
    [junit]   5/8: 0x7fc24c01aa80
    [junit]   6/8: 0x7fc24c01aac0
    [junit]   7/8: 0x7fc249d64990
    [junit] Testing accessing PointerBuffer values [0..7]
    [junit]   0/8: 0x7fc24c01fd80
    [junit]   1/8: 0x7fc249d552b0
    [junit]   2/8: 0x7fc249d552f0
    [junit]   3/8: 0x7fc249d55330
    [junit]   4/8: 0x7fc24c01aa40
    [junit]   5/8: 0x7fc24c01aa80
    [junit]   6/8: 0x7fc24c01aac0
    [junit]   7/8: 0x7fc249d64990
    [junit] Testing accessing PointerBuffer values [0..7]
    [junit]   0/8: 0x7fc249d649d0
    [junit]   1/8: 0x7fc249d64a10
    [junit]   2/8: 0x7fc24c020f00
    [junit]   3/8: 0x7fc24c020f40
    [junit]   4/8: 0x7fc24c020f80
    [junit]   5/8: 0x7fc24c00afc0
    [junit]   6/8: 0x7fc24c00b000
    [junit]   7/8: 0x7fc24c00b040
    [junit] Testing accessing PointerBuffer values [0..7]
    [junit]   0/8: 0x7fc249da2230
    [junit]   1/8: 0x7fc249da2270
    [junit]   2/8: 0x7fc249da22b0
    [junit]   3/8: 0x7fc24c00ca90
    [junit]   4/8: 0x7fc24c00cad0
    [junit]   5/8: 0x7fc24c00cb10
    [junit]   6/8: 0x7fc24c027e60
    [junit]   7/8: 0x7fc24c027ea0
    [junit] Testing accessing PointerBuffer values [0..7]
    [junit]   0/8: 0x7fc249da2230
    [junit]   1/8: 0x7fc249da2270
    [junit]   2/8: 0x7fc249da22b0
    [junit]   3/8: 0x7fc24c00ca90
    [junit]   4/8: 0x7fc24c00cad0
    [junit]   5/8: 0x7fc24c00cb10
    [junit]   6/8: 0x7fc24c027e60
    [junit]   7/8: 0x7fc24c027ea0
    [junit] Testing accessing PointerBuffer values [0..7]
    [junit]   0/8: 0x7fc249d5b010
    [junit]   1/8: 0x7fc249d5b010
    [junit]   2/8: 0x7fc249d5b010
    [junit]   3/8: 0x7fc249d5b010
    [junit]   4/8: 0x7fc249d5b010
    [junit]   5/8: 0x7fc249d5b010
    [junit]   6/8: 0x7fc249d5b010
    [junit]   7/8: 0x7fc249d5b010
    [junit] Testing accessing PointerBuffer values [0..7]
    [junit]   0/8: 0x4
    [junit]   1/8: 0x4
    [junit]   2/8: 0x4
    [junit]   3/8: 0x4
    [junit]   4/8: 0x4
    [junit]   5/8: 0x4
    [junit]   6/8: 0x4
    [junit]   7/8: 0x4
    [junit] ++++ TestCase.tearDown: com.jogamp.gluegen.test.junit.generation.Test1p1JavaEmitter - chapter03bTestCoverageFunctionalityIndirectNIOAndPrimitiveArray
    [junit] ++++ TestCase.setUp: com.jogamp.gluegen.test.junit.generation.Test1p1JavaEmitter - chapter04TestPointerBuffer
    [junit] Testing accessing PointerBuffer values [0..0]
    [junit]   0/1: 0xdeadbeef
    [junit] Testing accessing PointerBuffer values [0..0]
    [junit]   0/1: 0xdeadbeef
    [junit] Testing accessing PointerBuffer values [0..0]
    [junit]   0/1: 0xdeadbeef
    [junit] Testing accessing PointerBuffer values [0..0]
    [junit]   0/1: 0xdeadbeef
    [junit] Testing accessing PointerBuffer values [0..0]
    [junit]   0/1: 0xdeadbeef
    [junit] Testing accessing PointerBuffer values [0..0]
    [junit]   0/1: 0xdeadbeef
    [junit] Testing accessing PointerBuffer values [0..0]
    [junit]   0/1: 0xdeadbeef
    [junit] Testing accessing PointerBuffer values [0..0]
    [junit]   0/1: 0xdeadbeef
    [junit] ++++ TestCase.tearDown: com.jogamp.gluegen.test.junit.generation.Test1p1JavaEmitter - chapter04TestPointerBuffer
    [junit] ++++ TestCase.setUp: com.jogamp.gluegen.test.junit.generation.Test1p1JavaEmitter - chapter05TestSomeFunctionsAllIndirect
    [junit] ArrayCopy.01: [1, 2, 3, 4, 5, 6, 7, 8, 9, 0]
    [junit] ArrayCopy.02: [1, 2, 3, 4, 5, 6, 7, 8, 9, 0], java.nio.HeapIntBuffer[pos=0 lim=10 cap=10]
    [junit] ArrayCopy.03: [4, 5, 6, 7]
    [junit] ArrayCopy.04: [0, 0, 0, 4, 5, 6, 7, 0, 0, 0]
    [junit] ArrayCopy.05: [0, 0, 0, 4, 5, 6, 7, 0, 0, 0], java.nio.HeapIntBuffer[pos=0 lim=10 cap=10]
    [junit] ++++ TestCase.tearDown: com.jogamp.gluegen.test.junit.generation.Test1p1JavaEmitter - chapter05TestSomeFunctionsAllIndirect
    [junit] ++++ TestCase.setUp: com.jogamp.gluegen.test.junit.generation.Test1p1JavaEmitter - chapter09TestCompoundAlignment
    [junit] static  md: MachineDescriptionStatic: X86_64_UNIX(2): MachineDescription: runtimeValidated false, littleEndian true, 32Bit false, primitive size / alignment:
    [junit]   int8    1 / 1, int16   2 / 2
    [junit]   int     4 / 4, long    8 / 8
    [junit]   int32   4 / 4, int64   8 / 8
    [junit]   float   4 / 4, double  8 / 8, ldouble 16 / 16
    [junit]   pointer 8 / 8, page    4096
    [junit] runtime md: MachineDescription: runtimeValidated true, littleEndian true, 32Bit false, primitive size / alignment:
    [junit]   int8    1 / 1, int16   2 / 2
    [junit]   int     4 / 4, long    8 / 8
    [junit]   int32   4 / 4, int64   8 / 8
    [junit]   float   4 / 4, double  8 / 8, ldouble 16 / 16
    [junit]   pointer 8 / 8, page    4096
    [junit] compatible static/runtime: true
    [junit] ++++ TestCase.tearDown: com.jogamp.gluegen.test.junit.generation.Test1p1JavaEmitter - chapter09TestCompoundAlignment
    [junit] ++++ TestCase.setUp: com.jogamp.gluegen.test.junit.generation.Test1p1JavaEmitter - chapter10TestCompoundCallByReference
    [junit] 0x123456789abcdef0 == 0x123456789abcdef0
    [junit] 0xa23456781abcdef0 == 0xa23456781abcdef0
    [junit] 0xb23456782abcdef0 == 0xb23456782abcdef0
    [junit] 0x123456789abcdef0 == 0x123456789abcdef0
    [junit] 0xa23456781abcdef0 == 0xa23456781abcdef0
    [junit] 0xb23456782abcdef0 == 0xb23456782abcdef0
    [junit] 0x123456789abcdef0 == 0x123456789abcdef0
    [junit] 0xa23456781abcdef0 == 0xa23456781abcdef0
    [junit] 0xb23456782abcdef0 == 0xb23456782abcdef0
    [junit] 0x123456789abcdef0 == 0x123456789abcdef0
    [junit] 0xa23456781abcdef0 == 0xa23456781abcdef0
    [junit] 0xb23456782abcdef0 == 0xb23456782abcdef0
    [junit] ch10: ref-dim 286331153/572662306 858993459x1145324612
    [junit] ++++ TestCase.tearDown: com.jogamp.gluegen.test.junit.generation.Test1p1JavaEmitter - chapter10TestCompoundCallByReference
    [junit] ++++ TestCase.setUp: com.jogamp.gluegen.test.junit.generation.Test1p1JavaEmitter - chapter11TestCompoundCallByValue
    [junit] ch11.0: ref-dim 286331153/572662306 858993459x1145324612
    [junit] ch11.0: val-dim 286331153/572662306 858993459x1145324612
    [junit] ch11.1: val-dim 11/22 33x44
    [junit] ch11.2: val-dim 11/22 33x44
    [junit] ch11.3: sameInstanceByVal false
    [junit] ch11.3: sameInstanceByRef false
    [junit] ch11.4: sum-dimArray 12/24 36x48
    [junit] ch11.5: dimsGet[0] 11/22 33x44
    [junit] ch11.5: dimsGet[1] 1/2 3x4
    [junit] ch11.6: sum-dimPair 12/24 36x48
    [junit] ch11.7: zero-dim[0] 0/0 0x0
    [junit] ch11.7: zero-dim[1] 0/0 0x0
    [junit] ch11.8: copyPrim2Dim 11/22 100x200
    [junit] ch11.9: copyDim2Prim 11/22 100x200
    [junit] ch11.10: expRGBAb 0x11, 0x22, 0x33, 0xffffffaa
    [junit] ch11.10: hasRGBAi 0x112233aa
    [junit] ch11.11: hasRGBAb 0x11, 0x22, 0x33, 0xffffffaa
    [junit] ch11.12: addInt 3
    [junit] ch11.13: addByte 3
    [junit] ++++ TestCase.tearDown: com.jogamp.gluegen.test.junit.generation.Test1p1JavaEmitter - chapter11TestCompoundCallByValue
    [junit] ++++ TestCase.setUp: com.jogamp.gluegen.test.junit.generation.Test1p1JavaEmitter - chapter12TestStructArrayModelConst
    [junit] 0x123456789abcdef0 == 0x123456789abcdef0
    [junit] 0x123456789abcdef0 == 0x123456789abcdef0
    [junit] has 'Hello Array'
    [junit] has   0: 0x48 H
    [junit] has   1: 0x65 e
    [junit] has   2: 0x6C l
    [junit] has   3: 0x6C l
    [junit] has   4: 0x6F o
    [junit] has   5: 0x20  
    [junit] has   6: 0x41 A
    [junit] has   7: 0x72 r
    [junit] has   8: 0x72 r
    [junit] has   9: 0x61 a
    [junit] has  10: 0x79 y
    [junit] has 'Hello CString'
    [junit] has   0: 0x48 H
    [junit] has   1: 0x65 e
    [junit] has   2: 0x6C l
    [junit] has   3: 0x6C l
    [junit] has   4: 0x6F o
    [junit] has   5: 0x20  
    [junit] has   6: 0x43 C
    [junit] has   7: 0x53 S
    [junit] has   8: 0x74 t
    [junit] has   9: 0x72 r
    [junit] has  10: 0x69 i
    [junit] has  11: 0x6E n
    [junit] has  12: 0x67 g
    [junit] has 'Hello Pointer'
    [junit] has   0: 0x48 H
    [junit] has   1: 0x65 e
    [junit] has   2: 0x6C l
    [junit] has   3: 0x6C l
    [junit] has   4: 0x6F o
    [junit] has   5: 0x20  
    [junit] has   6: 0x50 P
    [junit] has   7: 0x6F o
    [junit] has   8: 0x69 i
    [junit] has   9: 0x6E n
    [junit] has  10: 0x74 t
    [junit] has  11: 0x65 e
    [junit] has  12: 0x72 r
    [junit] ++++ TestCase.tearDown: com.jogamp.gluegen.test.junit.generation.Test1p1JavaEmitter - chapter12TestStructArrayModelConst
    [junit] ++++ TestCase.setUp: com.jogamp.gluegen.test.junit.generation.Test1p1JavaEmitter - chapter13TestStructArrayModelMutable
    [junit] 0x123456789abcdef0 == 0x123456789abcdef0
    [junit] 0x123456789abcdef0 == 0x123456789abcdef0
    [junit] ++++ TestCase.tearDown: com.jogamp.gluegen.test.junit.generation.Test1p1JavaEmitter - chapter13TestStructArrayModelMutable
    [junit] ------------- ---------------- ---------------
    [junit] 
    [junit] Testcase: chapter02TestClassExist took 0.006 sec
    [junit] Testcase: chapter03aTestCoverageFunctionalityDirectNIOAndPrimitiveArray took 0.01 sec
    [junit] Testcase: chapter03bTestCoverageFunctionalityIndirectNIOAndPrimitiveArray took 0.002 sec
    [junit] Testcase: chapter04TestPointerBuffer took 0.004 sec
    [junit] Testcase: chapter05TestSomeFunctionsAllIndirect took 0.001 sec
    [junit] Testcase: chapter09TestCompoundAlignment took 0.003 sec
    [junit] Testcase: chapter10TestCompoundCallByReference took 0.004 sec
    [junit] Testcase: chapter11TestCompoundCallByValue took 0.007 sec
    [junit] Testcase: chapter12TestStructArrayModelConst took 0.009 sec
    [junit] Testcase: chapter13TestStructArrayModelMutable took 0.004 sec
    [junit] Tests run: 10, Failures: 0, Errors: 0, Time elapsed: 0.179 sec
    [junit] 
    [junit] ------------- Standard Error -----------------
    [junit] ++++ TestCase.setUp: com.jogamp.gluegen.test.junit.generation.Test1p1JavaEmitter - chapter02TestClassExist
    [junit] ++++ TestCase.tearDown: com.jogamp.gluegen.test.junit.generation.Test1p1JavaEmitter - chapter02TestClassExist
    [junit] ++++ TestCase.setUp: com.jogamp.gluegen.test.junit.generation.Test1p1JavaEmitter - chapter03aTestCoverageFunctionalityDirectNIOAndPrimitiveArray
    [junit] ++++ TestCase.setUp: com.jogamp.gluegen.test.junit.generation.Test1p2LoadJNIAndImplLib - chapter02TestClassExist
    [junit] ++++ TestCase.tearDown: com.jogamp.gluegen.test.junit.generation.Test1p2LoadJNIAndImplLib - chapter02TestClassExist
    [junit] Testing accessing PointerBuffer values [0..7]
    [junit]   0/8: 0x7fc249dd1c30
    [junit]   1/8: 0x7fc249dd1c70
    [junit]   2/8: 0x7fc249dd1cb0
    [junit]   3/8: 0x7fc249dd1cf0
    [junit]   4/8: 0x7fc249dd1d30
    [junit]   5/8: 0x7fc249dd1d70
    [junit]   6/8: 0x7fc249dd1db0
    [junit]   7/8: 0x7fc249dd1df0
    [junit] Testing accessing PointerBuffer values [0..7]
    [junit]   0/8: 0x7fc249dd1c30
    [junit]   1/8: 0x7fc249dd1c70
    [junit]   2/8: 0x7fc249dd1cb0
    [junit]   3/8: 0x7fc249dd1cf0
    [junit]   4/8: 0x7fc249dd1d30
    [junit]   5/8: 0x7fc249dd1d70
    [junit]   6/8: 0x7fc249dd1db0
    [junit]   7/8: 0x7fc249dd1df0
    [junit] Testing accessing PointerBuffer values [0..7]
    [junit]   0/8: 0x7fc249cc0940
    [junit]   1/8: 0x7fc249ca4380
    [junit]   2/8: 0x7fc249ca43c0
    [junit]   3/8: 0x7fc249ca4400
    [junit]   4/8: 0x7fc249ca4440
    [junit]   5/8: 0x7fc249cacd50
    [junit]   6/8: 0x7fc249cacd90
    [junit]   7/8: 0x7fc249cacdd0
    [junit] Testing accessing PointerBuffer values [0..7]
    [junit]   0/8: 0x7fc249cc0940
    [junit]   1/8: 0x7fc249ca4380
    [junit]   2/8: 0x7fc249ca43c0
    [junit]   3/8: 0x7fc249ca4400
    [junit]   4/8: 0x7fc249ca4440
    [junit]   5/8: 0x7fc249cacd50
    [junit]   6/8: 0x7fc249cacd90
    [junit]   7/8: 0x7fc249cacdd0
    [junit] Testing accessing PointerBuffer values [0..7]
    [junit]   0/8: 0x7fc249c722f0
    [junit]   1/8: 0x7fc249c72330
    [junit]   2/8: 0x7fc249c72370
    [junit]   3/8: 0x7fc249c723b0
    [junit]   4/8: 0x7fc249cfae90
    [junit]   5/8: 0x7fc249cfaed0
    [junit]   6/8: 0x7fc249cfaf10
    [junit]   7/8: 0x7fc249cfaf50
    [junit] Testing accessing PointerBuffer values [0..7]
    [junit]   0/8: 0x7fc249cc0980
    [junit]   1/8: 0x7fc249c8d6e0
    [junit]   2/8: 0x7fc249c8d720
    [junit]   3/8: 0x7fc249c8ea40
    [junit]   4/8: 0x7fc249c8ea80
    [junit]   5/8: 0x7fc249c8eac0
    [junit]   6/8: 0x7fc249cf4c20
    [junit]   7/8: 0x7fc249cf4c60
    [junit] Testing accessing PointerBuffer values [0..7]
    [junit]   0/8: 0x7fc249cc0980
    [junit]   1/8: 0x7fc249c8d6e0
    [junit]   2/8: 0x7fc249c8d720
    [junit]   3/8: 0x7fc249c8ea40
    [junit]   4/8: 0x7fc249c8ea80
    [junit]   5/8: 0x7fc249c8eac0
    [junit]   6/8: 0x7fc249cf4c20
    [junit]   7/8: 0x7fc249cf4c60
    [junit] Testing accessing PointerBuffer values [0..7]
    [junit]   0/8: 0x7fc249de5f20
    [junit]   1/8: 0x7fc249de5f20
    [junit]   2/8: 0x7fc249de5f20
    [junit]   3/8: 0x7fc249de5f20
    [junit]   4/8: 0x7fc249de5f20
    [junit]   5/8: 0x7fc249de5f20
    [junit]   6/8: 0x7fc249de5f20
    [junit]   7/8: 0x7fc249de5f20
    [junit] Testing accessing PointerBuffer values [0..7]
    [junit]   0/8: 0x4
    [junit]   1/8: 0x4
    [junit]   2/8: 0x4
    [junit]   3/8: 0x4
    [junit]   4/8: 0x4
    [junit]   5/8: 0x4
    [junit]   6/8: 0x4
    [junit]   7/8: 0x4
    [junit] ++++ TestCase.tearDown: com.jogamp.gluegen.test.junit.generation.Test1p1JavaEmitter - chapter03aTestCoverageFunctionalityDirectNIOAndPrimitiveArray
    [junit] ++++ TestCase.setUp: com.jogamp.gluegen.test.junit.generation.Test1p1JavaEmitter - chapter03bTestCoverageFunctionalityIndirectNIOAndPrimitiveArray
    [junit] Testing accessing PointerBuffer values [0..7]
    [junit]   0/8: 0x11f9931e8
    [junit]   1/8: 0x11f993228
    [junit]   2/8: 0x11f993268
    [junit]   3/8: 0x11f9932a8
    [junit]   4/8: 0x11f9932e8
    [junit]   5/8: 0x11f993328
    [junit]   6/8: 0x11f993368
    [junit]   7/8: 0x11f9933a8
    [junit] Testing accessing PointerBuffer values [0..7]
    [junit]   0/8: 0x11f9931e8
    [junit]   1/8: 0x11f993228
    [junit]   2/8: 0x11f993268
    [junit]   3/8: 0x11f9932a8
    [junit]   4/8: 0x11f9932e8
    [junit]   5/8: 0x11f993328
    [junit]   6/8: 0x11f993368
    [junit]   7/8: 0x11f9933a8
    [junit] Testing accessing PointerBuffer values [0..7]
    [junit]   0/8: 0x7fc24c01fd80
    [junit]   1/8: 0x7fc249d552b0
    [junit]   2/8: 0x7fc249d552f0
    [junit]   3/8: 0x7fc249d55330
    [junit]   4/8: 0x7fc24c01aa40
    [junit]   5/8: 0x7fc24c01aa80
    [junit]   6/8: 0x7fc24c01aac0
    [junit]   7/8: 0x7fc249d64990
    [junit] Testing accessing PointerBuffer values [0..7]
    [junit]   0/8: 0x7fc24c01fd80
    [junit]   1/8: 0x7fc249d552b0
    [junit]   2/8: 0x7fc249d552f0
    [junit]   3/8: 0x7fc249d55330
    [junit]   4/8: 0x7fc24c01aa40
    [junit]   5/8: 0x7fc24c01aa80
    [junit]   6/8: 0x7fc24c01aac0
    [junit]   7/8: 0x7fc249d64990
    [junit] Testing accessing PointerBuffer values [0..7]
    [junit]   0/8: 0x7fc249d649d0
    [junit]   1/8: 0x7fc249d64a10
    [junit]   2/8: 0x7fc24c020f00
    [junit]   3/8: 0x7fc24c020f40
    [junit]   4/8: 0x7fc24c020f80
    [junit]   5/8: 0x7fc24c00afc0
    [junit]   6/8: 0x7fc24c00b000
    [junit]   7/8: 0x7fc24c00b040
    [junit] Testing accessing PointerBuffer values [0..7]
    [junit]   0/8: 0x7fc249da2230
    [junit]   1/8: 0x7fc249da2270
    [junit]   2/8: 0x7fc249da22b0
    [junit]   3/8: 0x7fc24c00ca90
    [junit]   4/8: 0x7fc24c00cad0
    [junit]   5/8: 0x7fc24c00cb10
    [junit]   6/8: 0x7fc24c027e60
    [junit]   7/8: 0x7fc24c027ea0
    [junit] Testing accessing PointerBuffer values [0..7]
    [junit]   0/8: 0x7fc249da2230
    [junit]   1/8: 0x7fc249da2270
    [junit]   2/8: 0x7fc249da22b0
    [junit]   3/8: 0x7fc24c00ca90
    [junit]   4/8: 0x7fc24c00cad0
    [junit]   5/8: 0x7fc24c00cb10
    [junit]   6/8: 0x7fc24c027e60
    [junit]   7/8: 0x7fc24c027ea0
    [junit] Testing accessing PointerBuffer values [0..7]
    [junit]   0/8: 0x7fc249d5b010
    [junit]   1/8: 0x7fc249d5b010
    [junit]   2/8: 0x7fc249d5b010
    [junit]   3/8: 0x7fc249d5b010
    [junit]   4/8: 0x7fc249d5b010
    [junit]   5/8: 0x7fc249d5b010
    [junit]   6/8: 0x7fc249d5b010
    [junit]   7/8: 0x7fc249d5b010
    [junit] Testing accessing PointerBuffer values [0..7]
    [junit]   0/8: 0x4
    [junit]   1/8: 0x4
    [junit]   2/8: 0x4
    [junit]   3/8: 0x4
    [junit]   4/8: 0x4
    [junit]   5/8: 0x4
    [junit]   6/8: 0x4
    [junit]   7/8: 0x4
    [junit] ++++ TestCase.tearDown: com.jogamp.gluegen.test.junit.generation.Test1p1JavaEmitter - chapter03bTestCoverageFunctionalityIndirectNIOAndPrimitiveArray
    [junit] ++++ TestCase.setUp: com.jogamp.gluegen.test.junit.generation.Test1p1JavaEmitter - chapter04TestPointerBuffer
    [junit] Testing accessing PointerBuffer values [0..0]
    [junit]   0/1: 0xdeadbeef
    [junit] Testing accessing PointerBuffer values [0..0]
    [junit]   0/1: 0xdeadbeef
    [junit] Testing accessing PointerBuffer values [0..0]
    [junit]   0/1: 0xdeadbeef
    [junit] Testing accessing PointerBuffer values [0..0]
    [junit]   0/1: 0xdeadbeef
    [junit] Testing accessing PointerBuffer values [0..0]
    [junit]   0/1: 0xdeadbeef
    [junit] Testing accessing PointerBuffer values [0..0]
    [junit]   0/1: 0xdeadbeef
    [junit] Testing accessing PointerBuffer values [0..0]
    [junit]   0/1: 0xdeadbeef
    [junit] Testing accessing PointerBuffer values [0..0]
    [junit]   0/1: 0xdeadbeef
    [junit] ++++ TestCase.tearDown: com.jogamp.gluegen.test.junit.generation.Test1p1JavaEmitter - chapter04TestPointerBuffer
    [junit] ++++ TestCase.setUp: com.jogamp.gluegen.test.junit.generation.Test1p1JavaEmitter - chapter05TestSomeFunctionsAllIndirect
    [junit] ArrayCopy.01: [1, 2, 3, 4, 5, 6, 7, 8, 9, 0]
    [junit] ArrayCopy.02: [1, 2, 3, 4, 5, 6, 7, 8, 9, 0], java.nio.HeapIntBuffer[pos=0 lim=10 cap=10]
    [junit] ArrayCopy.03: [4, 5, 6, 7]
    [junit] ArrayCopy.04: [0, 0, 0, 4, 5, 6, 7, 0, 0, 0]
    [junit] ArrayCopy.05: [0, 0, 0, 4, 5, 6, 7, 0, 0, 0], java.nio.HeapIntBuffer[pos=0 lim=10 cap=10]
    [junit] ++++ TestCase.tearDown: com.jogamp.gluegen.test.junit.generation.Test1p1JavaEmitter - chapter05TestSomeFunctionsAllIndirect
    [junit] ++++ TestCase.setUp: com.jogamp.gluegen.test.junit.generation.Test1p1JavaEmitter - chapter09TestCompoundAlignment
    [junit] static  md: MachineDescriptionStatic: X86_64_UNIX(2): MachineDescription: runtimeValidated false, littleEndian true, 32Bit false, primitive size / alignment:
    [junit]   int8    1 / 1, int16   2 / 2
    [junit]   int     4 / 4, long    8 / 8
    [junit]   int32   4 / 4, int64   8 / 8
    [junit]   float   4 / 4, double  8 / 8, ldouble 16 / 16
    [junit]   pointer 8 / 8, page    4096
    [junit] runtime md: MachineDescription: runtimeValidated true, littleEndian true, 32Bit false, primitive size / alignment:
    [junit]   int8    1 / 1, int16   2 / 2
    [junit]   int     4 / 4, long    8 / 8
    [junit]   int32   4 / 4, int64   8 / 8
    [junit]   float   4 / 4, double  8 / 8, ldouble 16 / 16
    [junit]   pointer 8 / 8, page    4096
    [junit] compatible static/runtime: true
    [junit] ++++ TestCase.tearDown: com.jogamp.gluegen.test.junit.generation.Test1p1JavaEmitter - chapter09TestCompoundAlignment
    [junit] ++++ TestCase.setUp: com.jogamp.gluegen.test.junit.generation.Test1p1JavaEmitter - chapter10TestCompoundCallByReference
    [junit] 0x123456789abcdef0 == 0x123456789abcdef0
    [junit] 0xa23456781abcdef0 == 0xa23456781abcdef0
    [junit] 0xb23456782abcdef0 == 0xb23456782abcdef0
    [junit] 0x123456789abcdef0 == 0x123456789abcdef0
    [junit] 0xa23456781abcdef0 == 0xa23456781abcdef0
    [junit] 0xb23456782abcdef0 == 0xb23456782abcdef0
    [junit] 0x123456789abcdef0 == 0x123456789abcdef0
    [junit] 0xa23456781abcdef0 == 0xa23456781abcdef0
    [junit] 0xb23456782abcdef0 == 0xb23456782abcdef0
    [junit] 0x123456789abcdef0 == 0x123456789abcdef0
    [junit] 0xa23456781abcdef0 == 0xa23456781abcdef0
    [junit] 0xb23456782abcdef0 == 0xb23456782abcdef0
    [junit] ch10: ref-dim 286331153/572662306 858993459x1145324612
    [junit] ++++ TestCase.tearDown: com.jogamp.gluegen.test.junit.generation.Test1p1JavaEmitter - chapter10TestCompoundCallByReference
    [junit] ++++ TestCase.setUp: com.jogamp.gluegen.test.junit.generation.Test1p1JavaEmitter - chapter11TestCompoundCallByValue
    [junit] ch11.0: ref-dim 286331153/572662306 858993459x1145324612
    [junit] ch11.0: val-dim 286331153/572662306 858993459x1145324612
    [junit] ch11.1: val-dim 11/22 33x44
    [junit] ch11.2: val-dim 11/22 33x44
    [junit] ch11.3: sameInstanceByVal false
    [junit] ch11.3: sameInstanceByRef false
    [junit] ch11.4: sum-dimArray 12/24 36x48
    [junit] ch11.5: dimsGet[0] 11/22 33x44
    [junit] ch11.5: dimsGet[1] 1/2 3x4
    [junit] ch11.6: sum-dimPair 12/24 36x48
    [junit] ch11.7: zero-dim[0] 0/0 0x0
    [junit] ch11.7: zero-dim[1] 0/0 0x0
    [junit] ch11.8: copyPrim2Dim 11/22 100x200
    [junit] ch11.9: copyDim2Prim 11/22 100x200
    [junit] ch11.10: expRGBAb 0x11, 0x22, 0x33, 0xffffffaa
    [junit] ch11.10: hasRGBAi 0x112233aa
    [junit] ch11.11: hasRGBAb 0x11, 0x22, 0x33, 0xffffffaa
    [junit] ch11.12: addInt 3
    [junit] ch11.13: addByte 3
    [junit] ++++ TestCase.tearDown: com.jogamp.gluegen.test.junit.generation.Test1p1JavaEmitter - chapter11TestCompoundCallByValue
    [junit] ++++ TestCase.setUp: com.jogamp.gluegen.test.junit.generation.Test1p1JavaEmitter - chapter12TestStructArrayModelConst
    [junit] 0x123456789abcdef0 == 0x123456789abcdef0
    [junit] 0x123456789abcdef0 == 0x123456789abcdef0
    [junit] has 'Hello Array'
    [junit] has   0: 0x48 H
    [junit] has   1: 0x65 e
    [junit] has   2: 0x6C l
    [junit] has   3: 0x6C l
    [junit] has   4: 0x6F o
    [junit] has   5: 0x20  
    [junit] has   6: 0x41 A
    [junit] has   7: 0x72 r
    [junit] has   8: 0x72 r
    [junit] has   9: 0x61 a
    [junit] has  10: 0x79 y
    [junit] has 'Hello CString'
    [junit] has   0: 0x48 H
    [junit] has   1: 0x65 e
    [junit] has   2: 0x6C l
    [junit] has   3: 0x6C l
    [junit] has   4: 0x6F o
    [junit] has   5: 0x20  
    [junit] has   6: 0x43 C
    [junit] has   7: 0x53 S
    [junit] has   8: 0x74 t
    [junit] has   9: 0x72 r
    [junit] has  10: 0x69 i
    [junit] has  11: 0x6E n
    [junit] has  12: 0x67 g
    [junit] has 'Hello Pointer'
    [junit] has   0: 0x48 H
    [junit] has   1: 0x65 e
    [junit] has   2: 0x6C l
    [junit] has   3: 0x6C l
    [junit] has   4: 0x6F o
    [junit] has   5: 0x20  
    [junit] has   6: 0x50 P
    [junit] has   7: 0x6F o
    [junit] has   8: 0x69 i
    [junit] has   9: 0x6E n
    [junit] has  10: 0x74 t
    [junit] has  11: 0x65 e
    [junit] has  12: 0x72 r
    [junit] ++++ TestCase.tearDown: com.jogamp.gluegen.test.junit.generation.Test1p1JavaEmitter - chapter12TestStructArrayModelConst
    [junit] ++++ TestCase.setUp: com.jogamp.gluegen.test.junit.generation.Test1p1JavaEmitter - chapter13TestStructArrayModelMutable
    [junit] 0x123456789abcdef0 == 0x123456789abcdef0
    [junit] 0x123456789abcdef0 == 0x123456789abcdef0
    [junit] ++++ TestCase.tearDown: com.jogamp.gluegen.test.junit.generation.Test1p1JavaEmitter - chapter13TestStructArrayModelMutable
    [junit] ------------- ---------------- ---------------
    [junit] Testsuite: com.jogamp.gluegen.test.junit.generation.Test1p2LoadJNIAndImplLib
    [junit] Testsuite: com.jogamp.gluegen.test.junit.generation.Test1p2LoadJNIAndImplLib
    [junit] ++++ TestCase.setUp: com.jogamp.gluegen.test.junit.generation.Test1p2ProcAddressEmitter - chapter02TestClassExist
    [junit] ++++ TestCase.tearDown: com.jogamp.gluegen.test.junit.generation.Test1p2ProcAddressEmitter - chapter02TestClassExist
    [junit] ++++ TestCase.setUp: com.jogamp.gluegen.test.junit.generation.Test1p2ProcAddressEmitter - chapter03aTestCoverageFunctionalityDirectNIOAndPrimitiveArray
    [junit] Testing accessing PointerBuffer values [0..7]
    [junit]   0/8: 0x7fc249dd1c30
    [junit]   1/8: 0x7fc249dd1c70
    [junit]   2/8: 0x7fc249dd1cb0
    [junit]   3/8: 0x7fc249dd1cf0
    [junit]   4/8: 0x7fc249dd1d30
    [junit]   5/8: 0x7fc249dd1d70
    [junit]   6/8: 0x7fc249dd1db0
    [junit]   7/8: 0x7fc249dd1df0
    [junit] Testing accessing PointerBuffer values [0..7]
    [junit]   0/8: 0x7fc249dd1c30
    [junit]   1/8: 0x7fc249dd1c70
    [junit]   2/8: 0x7fc249dd1cb0
    [junit]   3/8: 0x7fc249dd1cf0
    [junit]   4/8: 0x7fc249dd1d30
    [junit]   5/8: 0x7fc249dd1d70
    [junit]   6/8: 0x7fc249dd1db0
    [junit]   7/8: 0x7fc249dd1df0
    [junit] Testing accessing PointerBuffer values [0..7]
    [junit]   0/8: 0x7fc249d68c80
    [junit]   1/8: 0x7fc249dd1a90
    [junit]   2/8: 0x7fc249dd1ad0
    [junit]   3/8: 0x7fc249dd1b10
    [junit]   4/8: 0x7fc249dd1b50
    [junit]   5/8: 0x7fc249dd7050
    [junit]   6/8: 0x7fc249dd7090
    [junit]   7/8: 0x7fc249dd70d0
    [junit] Testing accessing PointerBuffer values [0..7]
    [junit]   0/8: 0x7fc249d68c80
    [junit]   1/8: 0x7fc249dd1a90
    [junit]   2/8: 0x7fc249dd1ad0
    [junit]   3/8: 0x7fc249dd1b10
    [junit]   4/8: 0x7fc249dd1b50
    [junit]   5/8: 0x7fc249dd7050
    [junit]   6/8: 0x7fc249dd7090
    [junit]   7/8: 0x7fc249dd70d0
    [junit] Testing accessing PointerBuffer values [0..7]
    [junit]   0/8: 0x7fc24c00f4d0
    [junit]   1/8: 0x7fc24c00f510
    [junit]   2/8: 0x7fc24c00f550
    [junit]   3/8: 0x7fc24c00f590
    [junit]   4/8: 0x7fc249d59ab0
    [junit]   5/8: 0x7fc249d59af0
    [junit]   6/8: 0x7fc249d59b30
    [junit]   7/8: 0x7fc249d59b70
    [junit] Testing accessing PointerBuffer values [0..7]
    [junit]   0/8: 0x7fc249dd4290
    [junit]   1/8: 0x7fc249d633b0
    [junit]   2/8: 0x7fc249d633f0
    [junit]   3/8: 0x7fc249d9f970
    [junit]   4/8: 0x7fc249d9f9b0
    [junit]   5/8: 0x7fc249d9f9f0
    [junit]   6/8: 0x7fc249ddbe90
    [junit]   7/8: 0x7fc249ddbed0
    [junit] Testing accessing PointerBuffer values [0..7]
    [junit]   0/8: 0x7fc249dd4290
    [junit]   1/8: 0x7fc249d633b0
    [junit]   2/8: 0x7fc249d633f0
    [junit]   3/8: 0x7fc249d9f970
    [junit]   4/8: 0x7fc249d9f9b0
    [junit]   5/8: 0x7fc249d9f9f0
    [junit]   6/8: 0x7fc249ddbe90
    [junit]   7/8: 0x7fc249ddbed0
    [junit] Testing accessing PointerBuffer values [0..7]
    [junit]   0/8: 0x7fc249d59bb0
    [junit]   1/8: 0x7fc249d59bb0
    [junit]   2/8: 0x7fc249d59bb0
    [junit]   3/8: 0x7fc249d59bb0
    [junit]   4/8: 0x7fc249d59bb0
    [junit]   5/8: 0x7fc249d59bb0
    [junit]   6/8: 0x7fc249d59bb0
    [junit]   7/8: 0x7fc249d59bb0
    [junit] Testing accessing PointerBuffer values [0..7]
    [junit]   0/8: 0x4
    [junit]   1/8: 0x4
    [junit]   2/8: 0x4
    [junit]   3/8: 0x4
    [junit]   4/8: 0x4
    [junit]   5/8: 0x4
    [junit]   6/8: 0x4
    [junit]   7/8: 0x4
    [junit] ++++ TestCase.tearDown: com.jogamp.gluegen.test.junit.generation.Test1p2ProcAddressEmitter - chapter03aTestCoverageFunctionalityDirectNIOAndPrimitiveArray
    [junit] ++++ TestCase.setUp: com.jogamp.gluegen.test.junit.generation.Test1p2ProcAddressEmitter - chapter03bTestCoverageFunctionalityIndirectNIOAndPrimitiveArray
    [junit] Testing accessing PointerBuffer values [0..7]
    [junit]   0/8: 0x11f92c238
    [junit]   1/8: 0x11f92c278
    [junit]   2/8: 0x11f92c2b8
    [junit]   3/8: 0x11f92c2f8
    [junit]   4/8: 0x11f92c338
    [junit]   5/8: 0x11f92c378
    [junit]   6/8: 0x11f92c3b8
    [junit]   7/8: 0x11f92c3f8
    [junit] Testing accessing PointerBuffer values [0..7]
    [junit]   0/8: 0x11f92c238
    [junit]   1/8: 0x11f92c278
    [junit]   2/8: 0x11f92c2b8
    [junit]   3/8: 0x11f92c2f8
    [junit]   4/8: 0x11f92c338
    [junit]   5/8: 0x11f92c378
    [junit]   6/8: 0x11f92c3b8
    [junit]   7/8: 0x11f92c3f8
    [junit] Testing accessing PointerBuffer values [0..7]
    [junit]   0/8: 0x7fc249d84bf0
    [junit]   1/8: 0x7fc249d84c30
    [junit]   2/8: 0x7fc249d84c70
    [junit]   3/8: 0x7fc249dab670
    [junit]   4/8: 0x7fc249dab6b0
    [junit]   5/8: 0x7fc249dab6f0
    [junit]   6/8: 0x7fc249dab730
    [junit]   7/8: 0x7fc249df5830
    [junit] Testing accessing PointerBuffer values [0..7]
    [junit]   0/8: 0x7fc249d84bf0
    [junit]   1/8: 0x7fc249d84c30
    [junit]   2/8: 0x7fc249d84c70
    [junit]   3/8: 0x7fc249dab670
    [junit]   4/8: 0x7fc249dab6b0
    [junit]   5/8: 0x7fc249dab6f0
    [junit]   6/8: 0x7fc249dab730
    [junit]   7/8: 0x7fc249df5830
    [junit] Testing accessing PointerBuffer values [0..7]
    [junit]   0/8: 0x7fc249df5870
    [junit]   1/8: 0x7fc249df58b0
    [junit]   2/8: 0x7fc249df58f0
    [junit]   3/8: 0x7fc249dfba70
    [junit]   4/8: 0x7fc249ccfa00
    [junit]   5/8: 0x7fc249ccfa40
    [junit]   6/8: 0x7fc249cc7ee0
    [junit]   7/8: 0x7fc249cc7f20
    [junit] Testing accessing PointerBuffer values [0..7]
    [junit]   0/8: 0x7fc249cc7f60
    [junit]   1/8: 0x7fc249cc7fa0
    [junit]   2/8: 0x7fc249c77650
    [junit]   3/8: 0x7fc249c77690
    [junit]   4/8: 0x7fc249c776d0
    [junit]   5/8: 0x7fc249c77710
    [junit]   6/8: 0x7fc249cd20e0
    [junit]   7/8: 0x7fc249cd2120
    [junit] Testing accessing PointerBuffer values [0..7]
    [junit]   0/8: 0x7fc249cc7f60
    [junit]   1/8: 0x7fc249cc7fa0
    [junit]   2/8: 0x7fc249c77650
    [junit]   3/8: 0x7fc249c77690
    [junit]   4/8: 0x7fc249c776d0
    [junit]   5/8: 0x7fc249c77710
    [junit]   6/8: 0x7fc249cd20e0
    [junit]   7/8: 0x7fc249cd2120
    [junit] Testing accessing PointerBuffer values [0..7]
    [junit]   0/8: 0x7fc249ccfa80
    [junit]   1/8: 0x7fc249ccfa80
    [junit]   2/8: 0x7fc249ccfa80
    [junit]   3/8: 0x7fc249ccfa80
    [junit]   4/8: 0x7fc249ccfa80
    [junit]   5/8: 0x7fc249ccfa80
    [junit]   6/8: 0x7fc249ccfa80
    [junit]   7/8: 0x7fc249ccfa80
    [junit] Testing accessing PointerBuffer values [0..7]
    [junit]   0/8: 0x4
    [junit]   1/8: 0x4
    [junit]   2/8: 0x4
    [junit]   3/8: 0x4
    [junit]   4/8: 0x4
    [junit]   5/8: 0x4
    [junit]   6/8: 0x4
    [junit]   7/8: 0x4
    [junit] ++++ TestCase.tearDown: com.jogamp.gluegen.test.junit.generation.Test1p2ProcAddressEmitter - chapter03bTestCoverageFunctionalityIndirectNIOAndPrimitiveArray
    [junit] ++++ TestCase.setUp: com.jogamp.gluegen.test.junit.generation.Test1p2ProcAddressEmitter - chapter04TestPointerBuffer
    [junit] Testing accessing PointerBuffer values [0..0]
    [junit]   0/1: 0xdeadbeef
    [junit] Tests run: 1, Failures: 0, Errors: 0, Time elapsed: 0.073 sec
    [junit] ------------- Standard Error -----------------
    [junit] ++++ TestCase.setUp: com.jogamp.gluegen.test.junit.generation.Test1p2LoadJNIAndImplLib - chapter02TestClassExist
    [junit] ++++ TestCase.tearDown: com.jogamp.gluegen.test.junit.generation.Test1p2LoadJNIAndImplLib - chapter02TestClassExist
    [junit] ------------- ---------------- ---------------
    [junit] 
    [junit] Testcase: chapter02TestClassExist took 0 sec
    [junit] Tests run: 1, Failures: 0, Errors: 0, Time elapsed: 0.073 sec
    [junit] 
    [junit] ------------- Standard Error -----------------
    [junit] ++++ TestCase.setUp: com.jogamp.gluegen.test.junit.generation.Test1p2LoadJNIAndImplLib - chapter02TestClassExist
    [junit] ++++ TestCase.tearDown: com.jogamp.gluegen.test.junit.generation.Test1p2LoadJNIAndImplLib - chapter02TestClassExist
    [junit] ------------- ---------------- ---------------
    [junit] Testsuite: com.jogamp.gluegen.test.junit.generation.Test1p2ProcAddressEmitter
    [junit] Testsuite: com.jogamp.gluegen.test.junit.generation.Test1p2ProcAddressEmitter
    [junit] Testing accessing PointerBuffer values [0..0]
    [junit]   0/1: 0xdeadbeef
    [junit] Testing accessing PointerBuffer values [0..0]
    [junit]   0/1: 0xdeadbeef
    [junit] Testing accessing PointerBuffer values [0..0]
    [junit]   0/1: 0xdeadbeef
    [junit] Testing accessing PointerBuffer values [0..0]
    [junit]   0/1: 0xdeadbeef
    [junit] Testing accessing PointerBuffer values [0..0]
    [junit]   0/1: 0xdeadbeef
    [junit] Testing accessing PointerBuffer values [0..0]
    [junit]   0/1: 0xdeadbeef
    [junit] Testing accessing PointerBuffer values [0..0]
    [junit]   0/1: 0xdeadbeef
    [junit] ++++ TestCase.tearDown: com.jogamp.gluegen.test.junit.generation.Test1p2ProcAddressEmitter - chapter04TestPointerBuffer
    [junit] ++++ TestCase.setUp: com.jogamp.gluegen.test.junit.generation.Test1p2ProcAddressEmitter - chapter05TestSomeFunctionsAllIndirect
    [junit] ArrayCopy.01: [1, 2, 3, 4, 5, 6, 7, 8, 9, 0]
    [junit] ArrayCopy.02: [1, 2, 3, 4, 5, 6, 7, 8, 9, 0], java.nio.HeapIntBuffer[pos=0 lim=10 cap=10]
    [junit] ArrayCopy.03: [4, 5, 6, 7]
    [junit] ArrayCopy.04: [0, 0, 0, 4, 5, 6, 7, 0, 0, 0]
    [junit] ArrayCopy.05: [0, 0, 0, 4, 5, 6, 7, 0, 0, 0], java.nio.HeapIntBuffer[pos=0 lim=10 cap=10]
    [junit] ++++ TestCase.tearDown: com.jogamp.gluegen.test.junit.generation.Test1p2ProcAddressEmitter - chapter05TestSomeFunctionsAllIndirect
    [junit] ++++ TestCase.setUp: com.jogamp.gluegen.test.junit.generation.Test1p2ProcAddressEmitter - chapter09TestCompoundAlignment
    [junit] static  md: MachineDescriptionStatic: X86_64_UNIX(2): MachineDescription: runtimeValidated false, littleEndian true, 32Bit false, primitive size / alignment:
    [junit]   int8    1 / 1, int16   2 / 2
    [junit]   int     4 / 4, long    8 / 8
    [junit]   int32   4 / 4, int64   8 / 8
    [junit]   float   4 / 4, double  8 / 8, ldouble 16 / 16
    [junit]   pointer 8 / 8, page    4096
    [junit] runtime md: MachineDescription: runtimeValidated true, littleEndian true, 32Bit false, primitive size / alignment:
    [junit]   int8    1 / 1, int16   2 / 2
    [junit]   int     4 / 4, long    8 / 8
    [junit]   int32   4 / 4, int64   8 / 8
    [junit]   float   4 / 4, double  8 / 8, ldouble 16 / 16
    [junit]   pointer 8 / 8, page    4096
    [junit] compatible static/runtime: true
    [junit] TK_ComplicatedSubSet: sizeof(): 72
    [junit] TK_ComplicatedSubSet: bits1-s offset: 0
    [junit] TK_ComplicatedSubSet:    id-s offset: 4
    [junit] TK_ComplicatedSubSet: bits2-s offset: 8
    [junit] TK_ComplicatedSubSet: long0-s offset: 16
    [junit] TK_ComplicatedSubSet: bits3-s offset: 24
    [junit] TK_ComplicatedSubSet: real0-s offset: 32
    [junit] TK_ComplicatedSubSet: bits4-s offset: 40
    [junit] TK_ComplicatedSubSet: real1-s offset: 44
    [junit] TK_ComplicatedSubSet: bits5-s offset: 48
    [junit] TK_ComplicatedSubSet: longX-s offset: 56
    [junit] TK_ComplicatedSubSet: bits6-s offset: 64
    [junit] TK_ComplicatedSuperSet: sizeof(): 168
    [junit] TK_ComplicatedSuperSet: bits1-s offset: 0
    [junit] TK_ComplicatedSuperSet:  sub1-s offset: 8
    [junit] TK_ComplicatedSuperSet: bits2-s offset: 80
    [junit] TK_ComplicatedSuperSet:  sub2-s offset: 88
    [junit] TK_ComplicatedSuperSet: bits3-s offset: 160
    [junit] createComplicatedSuperSet:
    [junit] TK_ComplicatedSuperSet [
    [junit] Tests run: 10, Failures: 0, Errors: 0, Time elapsed: 0.16 sec
    [junit]   cs.b1         0xA0
    [junit]   cs.sub1.b1    0xA1
    [junit]   cs.sub1.id    0x12345678
    [junit]   cs.sub1.b2    0xA2
    [junit]   cs.sub1.long0 0x123456789ABCDEF0
    [junit]   cs.sub1.b3    0xA3
    [junit]   cs.sub1.real0 3.14159 0X1.921FB54442D18P+1
    [junit]   cs.sub1.b4    0xA4
    [junit]   cs.sub1.real1 256.123 0X1.001F9AP+8
    [junit]   cs.sub1.b5    0xA5
    [junit]   cs.sub1.longX 0xDEADBEEF
    [junit]   cs.sub1.b6    0xA6
    [junit]   cs.b2         0xB0
    [junit]   cs.sub2.b1    0xB1
    [junit]   cs.sub2.id    0x12345678
    [junit]   cs.sub2.b2    0xB2
    [junit]   cs.sub2.long0 0x123456789ABCDEF0
    [junit]   cs.sub2.b3    0xB3
    [junit]   cs.sub2.real0 3.14159 0X1.921FB54442D18P+1
    [junit]   cs.sub2.b4    0xB4
    [junit]   cs.sub2.real1 256.123 0X1.001F9AP+8
    [junit]   cs.sub2.b5    0xB5
    [junit]   cs.sub2.longX 0xDEADBEEF
    [junit]   cs.sub2.b6    0xB6
    [junit]   cs.b3         0xC0
    [junit] ]
    [junit] 
    [junit] hasInitValues res 1:
    [junit] TK_ComplicatedSuperSet [
    [junit]   cs.b1         0xA0
    [junit]   cs.sub1.b1    0xA1
    [junit]   cs.sub1.id    0x12345678
    [junit]   cs.sub1.b2    0xA2
    [junit]   cs.sub1.long0 0x123456789ABCDEF0
    [junit]   cs.sub1.b3    0xA3
    [junit]   cs.sub1.real0 3.14159 0X1.921FB54442D18P+1
    [junit]   cs.sub1.b4    0xA4
    [junit]   cs.sub1.real1 256.123 0X1.001F9AP+8
    [junit]   cs.sub1.b5    0xA5
    [junit]   cs.sub1.longX 0xDEADBEEF
    [junit]   cs.sub1.b6    0xA6
    [junit]   cs.b2         0xB0
    [junit]   cs.sub2.b1    0xB1
    [junit]   cs.sub2.id    0x12345678
    [junit]   cs.sub2.b2    0xB2
    [junit]   cs.sub2.long0 0x123456789ABCDEF0
    [junit]   cs.sub2.b3    0xB3
    [junit]   cs.sub2.real0 3.14159 0X1.921FB54442D18P+1
    [junit]   cs.sub2.b4    0xB4
    [junit]   cs.sub2.real1 256.123 0X1.001F9AP+8
    [junit]   cs.sub2.b5    0xB5
    [junit]   cs.sub2.longX 0xDEADBEEF
    [junit]   cs.sub2.b6    0xB6
    [junit]   cs.b3         0xC0
    [junit] ]
    [junit] 
    [junit] ++++ TestCase.tearDown: com.jogamp.gluegen.test.junit.generation.Test1p2ProcAddressEmitter - chapter09TestCompoundAlignment
    [junit] ++++ TestCase.setUp: com.jogamp.gluegen.test.junit.generation.Test1p2ProcAddressEmitter - chapter10TestCompoundCallByReference
    [junit] 0x123456789abcdef0 == 0x123456789abcdef0
    [junit] 0xa23456781abcdef0 == 0xa23456781abcdef0
    [junit] 0xb23456782abcdef0 == 0xb23456782abcdef0
    [junit] 0x123456789abcdef0 == 0x123456789abcdef0
    [junit] 0xa23456781abcdef0 == 0xa23456781abcdef0
    [junit] 0xb23456782abcdef0 == 0xb23456782abcdef0
    [junit] 0x123456789abcdef0 == 0x123456789abcdef0
    [junit] 0xa23456781abcdef0 == 0xa23456781abcdef0
    [junit] 0xb23456782abcdef0 == 0xb23456782abcdef0
    [junit] 0x123456789abcdef0 == 0x123456789abcdef0
    [junit] 0xa23456781abcdef0 == 0xa23456781abcdef0
    [junit] 0xb23456782abcdef0 == 0xb23456782abcdef0
    [junit] ch10: ref-dim 286331153/572662306 858993459x1145324612
    [junit] ++++ TestCase.tearDown: com.jogamp.gluegen.test.junit.generation.Test1p2ProcAddressEmitter - chapter10TestCompoundCallByReference
    [junit] ++++ TestCase.setUp: com.jogamp.gluegen.test.junit.generation.Test1p2ProcAddressEmitter - chapter11TestCompoundCallByValue
    [junit] ch11.0: ref-dim 286331153/572662306 858993459x1145324612
    [junit] XXX.getSurfaceBoundsValue: dim 286331153/572662306 858993459x1145324612
    [junit] ch11.0: val-dim 286331153/572662306 858993459x1145324612
    [junit] ch11.1: val-dim 11/22 33x44
    [junit] XXX.getSurfaceBoundsValue: dim 11/22 33x44
    [junit] ch11.2: val-dim 11/22 33x44
    [junit] ch11.3: sameInstanceByVal false
    [junit] ch11.3: sameInstanceByRef false
    [junit] ch11.4: sum-dimArray 12/24 36x48
    [junit] ch11.5: dimsGet[0] 11/22 33x44
    [junit] ch11.5: dimsGet[1] 1/2 3x4
    [junit] ch11.6: sum-dimPair 12/24 36x48
    [junit] ch11.7: zero-dim[0] 0/0 0x0
    [junit] ch11.7: zero-dim[1] 0/0 0x0
    [junit] ch11.8: copyPrim2Dim 11/22 100x200
    [junit] ch11.9: copyDim2Prim 11/22 100x200
    [junit] ch11.10: expRGBAb 0x11, 0x22, 0x33, 0xffffffaa
    [junit] ch11.10: hasRGBAi 0x112233aa
    [junit] ch11.11: hasRGBAb 0x11, 0x22, 0x33, 0xffffffaa
    [junit] ch11.12: addInt 3
    [junit] ch11.13: addByte 3
    [junit] ++++ TestCase.tearDown: com.jogamp.gluegen.test.junit.generation.Test1p2ProcAddressEmitter - chapter11TestCompoundCallByValue
    [junit] ++++ TestCase.setUp: com.jogamp.gluegen.test.junit.generation.Test1p2ProcAddressEmitter - chapter12TestStructArrayModelConst
    [junit] 0x123456789abcdef0 == 0x123456789abcdef0
    [junit] 0x123456789abcdef0 == 0x123456789abcdef0
    [junit] has 'Hello Array'
    [junit] has   0: 0x48 H
    [junit] has   1: 0x65 e
    [junit] has   2: 0x6C l
    [junit] has   3: 0x6C l
    [junit] has   4: 0x6F o
    [junit] has   5: 0x20  
    [junit] has   6: 0x41 A
    [junit] has   7: 0x72 r
    [junit] has   8: 0x72 r
    [junit] has   9: 0x61 a
    [junit] has  10: 0x79 y
    [junit] has 'Hello CString'
    [junit] has   0: 0x48 H
    [junit] has   1: 0x65 e
    [junit] has   2: 0x6C l
    [junit] has   3: 0x6C l
    [junit] has   4: 0x6F o
    [junit] has   5: 0x20  
    [junit] has   6: 0x43 C
    [junit] has   7: 0x53 S
    [junit] has   8: 0x74 t
    [junit] has   9: 0x72 r
    [junit] has  10: 0x69 i
    [junit] has  11: 0x6E n
    [junit] has  12: 0x67 g
    [junit] has 'Hello Pointer'
    [junit] has   0: 0x48 H
    [junit] has   1: 0x65 e
    [junit] has   2: 0x6C l
    [junit] has   3: 0x6C l
    [junit] has   4: 0x6F o
    [junit] has   5: 0x20  
    [junit] has   6: 0x50 P
    [junit] has   7: 0x6F o
    [junit] has   8: 0x69 i
    [junit] has   9: 0x6E n
    [junit] has  10: 0x74 t
    [junit] has  11: 0x65 e
    [junit] has  12: 0x72 r
    [junit] ++++ TestCase.tearDown: com.jogamp.gluegen.test.junit.generation.Test1p2ProcAddressEmitter - chapter12TestStructArrayModelConst
    [junit] ++++ TestCase.setUp: com.jogamp.gluegen.test.junit.generation.Test1p2ProcAddressEmitter - chapter13TestStructArrayModelMutable
    [junit] 0x123456789abcdef0 == 0x123456789abcdef0
    [junit] 0x123456789abcdef0 == 0x123456789abcdef0
    [junit] ++++ TestCase.tearDown: com.jogamp.gluegen.test.junit.generation.Test1p2ProcAddressEmitter - chapter13TestStructArrayModelMutable
    [junit] ------------- Standard Error -----------------
    [junit] ++++ TestCase.setUp: com.jogamp.gluegen.test.junit.generation.Test1p2ProcAddressEmitter - chapter02TestClassExist
    [junit] ++++ TestCase.tearDown: com.jogamp.gluegen.test.junit.generation.Test1p2ProcAddressEmitter - chapter02TestClassExist
    [junit] ++++ TestCase.setUp: com.jogamp.gluegen.test.junit.generation.Test1p2ProcAddressEmitter - chapter03aTestCoverageFunctionalityDirectNIOAndPrimitiveArray
    [junit] Testing accessing PointerBuffer values [0..7]
    [junit]   0/8: 0x7fc249dd1c30
    [junit]   1/8: 0x7fc249dd1c70
    [junit]   2/8: 0x7fc249dd1cb0
    [junit]   3/8: 0x7fc249dd1cf0
    [junit]   4/8: 0x7fc249dd1d30
    [junit]   5/8: 0x7fc249dd1d70
    [junit]   6/8: 0x7fc249dd1db0
    [junit]   7/8: 0x7fc249dd1df0
    [junit] Testing accessing PointerBuffer values [0..7]
    [junit]   0/8: 0x7fc249dd1c30
    [junit]   1/8: 0x7fc249dd1c70
    [junit]   2/8: 0x7fc249dd1cb0
    [junit]   3/8: 0x7fc249dd1cf0
    [junit]   4/8: 0x7fc249dd1d30
    [junit]   5/8: 0x7fc249dd1d70
    [junit]   6/8: 0x7fc249dd1db0
    [junit]   7/8: 0x7fc249dd1df0
    [junit] Testing accessing PointerBuffer values [0..7]
    [junit]   0/8: 0x7fc249d68c80
    [junit]   1/8: 0x7fc249dd1a90
    [junit]   2/8: 0x7fc249dd1ad0
    [junit]   3/8: 0x7fc249dd1b10
    [junit]   4/8: 0x7fc249dd1b50
    [junit]   5/8: 0x7fc249dd7050
    [junit]   6/8: 0x7fc249dd7090
    [junit]   7/8: 0x7fc249dd70d0
    [junit] Testing accessing PointerBuffer values [0..7]
    [junit]   0/8: 0x7fc249d68c80
    [junit]   1/8: 0x7fc249dd1a90
    [junit]   2/8: 0x7fc249dd1ad0
    [junit]   3/8: 0x7fc249dd1b10
    [junit]   4/8: 0x7fc249dd1b50
    [junit]   5/8: 0x7fc249dd7050
    [junit]   6/8: 0x7fc249dd7090
    [junit]   7/8: 0x7fc249dd70d0
    [junit] Testing accessing PointerBuffer values [0..7]
    [junit]   0/8: 0x7fc24c00f4d0
    [junit]   1/8: 0x7fc24c00f510
    [junit]   2/8: 0x7fc24c00f550
    [junit]   3/8: 0x7fc24c00f590
    [junit]   4/8: 0x7fc249d59ab0
    [junit]   5/8: 0x7fc249d59af0
    [junit]   6/8: 0x7fc249d59b30
    [junit]   7/8: 0x7fc249d59b70
    [junit] Testing accessing PointerBuffer values [0..7]
    [junit]   0/8: 0x7fc249dd4290
    [junit]   1/8: 0x7fc249d633b0
    [junit]   2/8: 0x7fc249d633f0
    [junit]   3/8: 0x7fc249d9f970
    [junit]   4/8: 0x7fc249d9f9b0
    [junit]   5/8: 0x7fc249d9f9f0
    [junit]   6/8: 0x7fc249ddbe90
    [junit]   7/8: 0x7fc249ddbed0
    [junit] Testing accessing PointerBuffer values [0..7]
    [junit]   0/8: 0x7fc249dd4290
    [junit]   1/8: 0x7fc249d633b0
    [junit]   2/8: 0x7fc249d633f0
    [junit]   3/8: 0x7fc249d9f970
    [junit]   4/8: 0x7fc249d9f9b0
    [junit]   5/8: 0x7fc249d9f9f0
    [junit]   6/8: 0x7fc249ddbe90
    [junit]   7/8: 0x7fc249ddbed0
    [junit] Testing accessing PointerBuffer values [0..7]
    [junit]   0/8: 0x7fc249d59bb0
    [junit]   1/8: 0x7fc249d59bb0
    [junit]   2/8: 0x7fc249d59bb0
    [junit]   3/8: 0x7fc249d59bb0
    [junit]   4/8: 0x7fc249d59bb0
    [junit]   5/8: 0x7fc249d59bb0
    [junit]   6/8: 0x7fc249d59bb0
    [junit]   7/8: 0x7fc249d59bb0
    [junit] Testing accessing PointerBuffer values [0..7]
    [junit]   0/8: 0x4
    [junit]   1/8: 0x4
    [junit]   2/8: 0x4
    [junit]   3/8: 0x4
    [junit]   4/8: 0x4
    [junit]   5/8: 0x4
    [junit]   6/8: 0x4
    [junit]   7/8: 0x4
    [junit] ++++ TestCase.tearDown: com.jogamp.gluegen.test.junit.generation.Test1p2ProcAddressEmitter - chapter03aTestCoverageFunctionalityDirectNIOAndPrimitiveArray
    [junit] ++++ TestCase.setUp: com.jogamp.gluegen.test.junit.generation.Test1p2ProcAddressEmitter - chapter03bTestCoverageFunctionalityIndirectNIOAndPrimitiveArray
    [junit] Testing accessing PointerBuffer values [0..7]
    [junit]   0/8: 0x11f92c238
    [junit]   1/8: 0x11f92c278
    [junit]   2/8: 0x11f92c2b8
    [junit]   3/8: 0x11f92c2f8
    [junit]   4/8: 0x11f92c338
    [junit]   5/8: 0x11f92c378
    [junit]   6/8: 0x11f92c3b8
    [junit]   7/8: 0x11f92c3f8
    [junit] Testing accessing PointerBuffer values [0..7]
    [junit]   0/8: 0x11f92c238
    [junit]   1/8: 0x11f92c278
    [junit]   2/8: 0x11f92c2b8
    [junit]   3/8: 0x11f92c2f8
    [junit]   4/8: 0x11f92c338
    [junit]   5/8: 0x11f92c378
    [junit]   6/8: 0x11f92c3b8
    [junit]   7/8: 0x11f92c3f8
    [junit] Testing accessing PointerBuffer values [0..7]
    [junit]   0/8: 0x7fc249d84bf0
    [junit]   1/8: 0x7fc249d84c30
    [junit]   2/8: 0x7fc249d84c70
    [junit]   3/8: 0x7fc249dab670
    [junit]   4/8: 0x7fc249dab6b0
    [junit]   5/8: 0x7fc249dab6f0
    [junit]   6/8: 0x7fc249dab730
    [junit]   7/8: 0x7fc249df5830
    [junit] Testing accessing PointerBuffer values [0..7]
    [junit]   0/8: 0x7fc249d84bf0
    [junit]   1/8: 0x7fc249d84c30
    [junit]   2/8: 0x7fc249d84c70
    [junit]   3/8: 0x7fc249dab670
    [junit]   4/8: 0x7fc249dab6b0
    [junit]   5/8: 0x7fc249dab6f0
    [junit]   6/8: 0x7fc249dab730
    [junit]   7/8: 0x7fc249df5830
    [junit] Testing accessing PointerBuffer values [0..7]
    [junit]   0/8: 0x7fc249df5870
    [junit]   1/8: 0x7fc249df58b0
    [junit]   2/8: 0x7fc249df58f0
    [junit]   3/8: 0x7fc249dfba70
    [junit]   4/8: 0x7fc249ccfa00
    [junit]   5/8: 0x7fc249ccfa40
    [junit]   6/8: 0x7fc249cc7ee0
    [junit]   7/8: 0x7fc249cc7f20
    [junit] Testing accessing PointerBuffer values [0..7]
    [junit]   0/8: 0x7fc249cc7f60
    [junit]   1/8: 0x7fc249cc7fa0
    [junit]   2/8: 0x7fc249c77650
    [junit]   3/8: 0x7fc249c77690
    [junit]   4/8: 0x7fc249c776d0
    [junit]   5/8: 0x7fc249c77710
    [junit]   6/8: 0x7fc249cd20e0
    [junit]   7/8: 0x7fc249cd2120
    [junit] Testing accessing PointerBuffer values [0..7]
    [junit]   0/8: 0x7fc249cc7f60
    [junit]   1/8: 0x7fc249cc7fa0
    [junit]   2/8: 0x7fc249c77650
    [junit]   3/8: 0x7fc249c77690
    [junit]   4/8: 0x7fc249c776d0
    [junit]   5/8: 0x7fc249c77710
    [junit]   6/8: 0x7fc249cd20e0
    [junit]   7/8: 0x7fc249cd2120
    [junit] Testing accessing PointerBuffer values [0..7]
    [junit]   0/8: 0x7fc249ccfa80
    [junit]   1/8: 0x7fc249ccfa80
    [junit]   2/8: 0x7fc249ccfa80
    [junit]   3/8: 0x7fc249ccfa80
    [junit]   4/8: 0x7fc249ccfa80
    [junit]   5/8: 0x7fc249ccfa80
    [junit]   6/8: 0x7fc249ccfa80
    [junit]   7/8: 0x7fc249ccfa80
    [junit] Testing accessing PointerBuffer values [0..7]
    [junit]   0/8: 0x4
    [junit]   1/8: 0x4
    [junit]   2/8: 0x4
    [junit]   3/8: 0x4
    [junit]   4/8: 0x4
    [junit]   5/8: 0x4
    [junit]   6/8: 0x4
    [junit]   7/8: 0x4
    [junit] ++++ TestCase.tearDown: com.jogamp.gluegen.test.junit.generation.Test1p2ProcAddressEmitter - chapter03bTestCoverageFunctionalityIndirectNIOAndPrimitiveArray
    [junit] ++++ TestCase.setUp: com.jogamp.gluegen.test.junit.generation.Test1p2ProcAddressEmitter - chapter04TestPointerBuffer
    [junit] Testing accessing PointerBuffer values [0..0]
    [junit]   0/1: 0xdeadbeef
    [junit] Testing accessing PointerBuffer values [0..0]
    [junit]   0/1: 0xdeadbeef
    [junit] Testing accessing PointerBuffer values [0..0]
    [junit]   0/1: 0xdeadbeef
    [junit] Testing accessing PointerBuffer values [0..0]
    [junit]   0/1: 0xdeadbeef
    [junit] Testing accessing PointerBuffer values [0..0]
    [junit]   0/1: 0xdeadbeef
    [junit] Testing accessing PointerBuffer values [0..0]
    [junit]   0/1: 0xdeadbeef
    [junit] Testing accessing PointerBuffer values [0..0]
    [junit]   0/1: 0xdeadbeef
    [junit] Testing accessing PointerBuffer values [0..0]
    [junit]   0/1: 0xdeadbeef
    [junit] ++++ TestCase.tearDown: com.jogamp.gluegen.test.junit.generation.Test1p2ProcAddressEmitter - chapter04TestPointerBuffer
    [junit] ++++ TestCase.setUp: com.jogamp.gluegen.test.junit.generation.Test1p2ProcAddressEmitter - chapter05TestSomeFunctionsAllIndirect
    [junit] ArrayCopy.01: [1, 2, 3, 4, 5, 6, 7, 8, 9, 0]
    [junit] ArrayCopy.02: [1, 2, 3, 4, 5, 6, 7, 8, 9, 0], java.nio.HeapIntBuffer[pos=0 lim=10 cap=10]
    [junit] ArrayCopy.03: [4, 5, 6, 7]
    [junit] ArrayCopy.04: [0, 0, 0, 4, 5, 6, 7, 0, 0, 0]
    [junit] ArrayCopy.05: [0, 0, 0, 4, 5, 6, 7, 0, 0, 0], java.nio.HeapIntBuffer[pos=0 lim=10 cap=10]
    [junit] ++++ TestCase.tearDown: com.jogamp.gluegen.test.junit.generation.Test1p2ProcAddressEmitter - chapter05TestSomeFunctionsAllIndirect
    [junit] ++++ TestCase.setUp: com.jogamp.gluegen.test.junit.generation.Test1p2ProcAddressEmitter - chapter09TestCompoundAlignment
    [junit] static  md: MachineDescriptionStatic: X86_64_UNIX(2): MachineDescription: runtimeValidated false, littleEndian true, 32Bit false, primitive size / alignment:
    [junit]   int8    1 / 1, int16   2 / 2
    [junit]   int     4 / 4, long    8 / 8
    [junit]   int32   4 / 4, int64   8 / 8
    [junit]   float   4 / 4, double  8 / 8, ldouble 16 / 16
    [junit]   pointer 8 / 8, page    4096
    [junit] runtime md: MachineDescription: runtimeValidated true, littleEndian true, 32Bit false, primitive size / alignment:
    [junit]   int8    1 / 1, int16   2 / 2
    [junit]   int     4 / 4, long    8 / 8
    [junit]   int32   4 / 4, int64   8 / 8
    [junit]   float   4 / 4, double  8 / 8, ldouble 16 / 16
    [junit]   pointer 8 / 8, page    4096
    [junit] compatible static/runtime: true
    [junit] ++++ TestCase.tearDown: com.jogamp.gluegen.test.junit.generation.Test1p2ProcAddressEmitter - chapter09TestCompoundAlignment
    [junit] ++++ TestCase.setUp: com.jogamp.gluegen.test.junit.generation.Test1p2ProcAddressEmitter - chapter10TestCompoundCallByReference
    [junit] 0x123456789abcdef0 == 0x123456789abcdef0
    [junit] 0xa23456781abcdef0 == 0xa23456781abcdef0
    [junit] 0xb23456782abcdef0 == 0xb23456782abcdef0
    [junit] 0x123456789abcdef0 == 0x123456789abcdef0
    [junit] 0xa23456781abcdef0 == 0xa23456781abcdef0
    [junit] 0xb23456782abcdef0 == 0xb23456782abcdef0
    [junit] 0x123456789abcdef0 == 0x123456789abcdef0
    [junit] 0xa23456781abcdef0 == 0xa23456781abcdef0
    [junit] 0xb23456782abcdef0 == 0xb23456782abcdef0
    [junit] 0x123456789abcdef0 == 0x123456789abcdef0
    [junit] 0xa23456781abcdef0 == 0xa23456781abcdef0
    [junit] 0xb23456782abcdef0 == 0xb23456782abcdef0
    [junit] ch10: ref-dim 286331153/572662306 858993459x1145324612
    [junit] ++++ TestCase.tearDown: com.jogamp.gluegen.test.junit.generation.Test1p2ProcAddressEmitter - chapter10TestCompoundCallByReference
    [junit] ++++ TestCase.setUp: com.jogamp.gluegen.test.junit.generation.Test1p2ProcAddressEmitter - chapter11TestCompoundCallByValue
    [junit] ch11.0: ref-dim 286331153/572662306 858993459x1145324612
    [junit] ch11.0: val-dim 286331153/572662306 858993459x1145324612
    [junit] ch11.1: val-dim 11/22 33x44
    [junit] ch11.2: val-dim 11/22 33x44
    [junit] ch11.3: sameInstanceByVal false
    [junit] ch11.3: sameInstanceByRef false
    [junit] ch11.4: sum-dimArray 12/24 36x48
    [junit] ch11.5: dimsGet[0] 11/22 33x44
    [junit] ch11.5: dimsGet[1] 1/2 3x4
    [junit] ch11.6: sum-dimPair 12/24 36x48
    [junit] ch11.7: zero-dim[0] 0/0 0x0
    [junit] ch11.7: zero-dim[1] 0/0 0x0
    [junit] ch11.8: copyPrim2Dim 11/22 100x200
    [junit] ch11.9: copyDim2Prim 11/22 100x200
    [junit] ch11.10: expRGBAb 0x11, 0x22, 0x33, 0xffffffaa
    [junit] ch11.10: hasRGBAi 0x112233aa
    [junit] ch11.11: hasRGBAb 0x11, 0x22, 0x33, 0xffffffaa
    [junit] ch11.12: addInt 3
    [junit] ch11.13: addByte 3
    [junit] ++++ TestCase.tearDown: com.jogamp.gluegen.test.junit.generation.Test1p2ProcAddressEmitter - chapter11TestCompoundCallByValue
    [junit] ++++ TestCase.setUp: com.jogamp.gluegen.test.junit.generation.Test1p2ProcAddressEmitter - chapter12TestStructArrayModelConst
    [junit] 0x123456789abcdef0 == 0x123456789abcdef0
    [junit] 0x123456789abcdef0 == 0x123456789abcdef0
    [junit] has 'Hello Array'
    [junit] has   0: 0x48 H
    [junit] has   1: 0x65 e
    [junit] has   2: 0x6C l
    [junit] has   3: 0x6C l
    [junit] has   4: 0x6F o
    [junit] has   5: 0x20  
    [junit] has   6: 0x41 A
    [junit] has   7: 0x72 r
    [junit] has   8: 0x72 r
    [junit] has   9: 0x61 a
    [junit] has  10: 0x79 y
    [junit] has 'Hello CString'
    [junit] has   0: 0x48 H
    [junit] has   1: 0x65 e
    [junit] has   2: 0x6C l
    [junit] has   3: 0x6C l
    [junit] has   4: 0x6F o
    [junit] has   5: 0x20  
    [junit] has   6: 0x43 C
    [junit] has   7: 0x53 S
    [junit] has   8: 0x74 t
    [junit] has   9: 0x72 r
    [junit] has  10: 0x69 i
    [junit] has  11: 0x6E n
    [junit] has  12: 0x67 g
    [junit] has 'Hello Pointer'
    [junit] has   0: 0x48 H
    [junit] has   1: 0x65 e
    [junit] has   2: 0x6C l
    [junit] has   3: 0x6C l
    [junit] has   4: 0x6F o
    [junit] has   5: 0x20  
    [junit] has   6: 0x50 P
    [junit] has   7: 0x6F o
    [junit] has   8: 0x69 i
    [junit] has   9: 0x6E n
    [junit] has  10: 0x74 t
    [junit] has  11: 0x65 e
    [junit] has  12: 0x72 r
    [junit] ++++ TestCase.tearDown: com.jogamp.gluegen.test.junit.generation.Test1p2ProcAddressEmitter - chapter12TestStructArrayModelConst
    [junit] ++++ TestCase.setUp: com.jogamp.gluegen.test.junit.generation.Test1p2ProcAddressEmitter - chapter13TestStructArrayModelMutable
    [junit] 0x123456789abcdef0 == 0x123456789abcdef0
    [junit] 0x123456789abcdef0 == 0x123456789abcdef0
    [junit] ++++ TestCase.tearDown: com.jogamp.gluegen.test.junit.generation.Test1p2ProcAddressEmitter - chapter13TestStructArrayModelMutable
    [junit] ------------- ---------------- ---------------
    [junit] 
    [junit] Testcase: chapter02TestClassExist took 0 sec
    [junit] Testcase: chapter03aTestCoverageFunctionalityDirectNIOAndPrimitiveArray took 0.014 sec
    [junit] Testcase: chapter03bTestCoverageFunctionalityIndirectNIOAndPrimitiveArray took 0.006 sec
    [junit] Testcase: chapter04TestPointerBuffer took 0.023 sec
    [junit] Testcase: chapter05TestSomeFunctionsAllIndirect took 0.001 sec
    [junit] Testcase: chapter09TestCompoundAlignment took 0.002 sec
    [junit] Testcase: chapter10TestCompoundCallByReference took 0.001 sec
    [junit] Testcase: chapter11TestCompoundCallByValue took 0.004 sec
    [junit] Testcase: chapter12TestStructArrayModelConst took 0.003 sec
    [junit] Testcase: chapter13TestStructArrayModelMutable took 0.002 sec
    [junit] Tests run: 10, Failures: 0, Errors: 0, Time elapsed: 0.16 sec
    [junit] 
    [junit] ------------- Standard Error -----------------
    [junit] ++++ TestCase.setUp: com.jogamp.gluegen.test.junit.generation.Test1p2ProcAddressEmitter - chapter02TestClassExist
    [junit] ++++ TestCase.tearDown: com.jogamp.gluegen.test.junit.generation.Test1p2ProcAddressEmitter - chapter02TestClassExist
    [junit] ++++ TestCase.setUp: com.jogamp.gluegen.test.junit.generation.Test1p2ProcAddressEmitter - chapter03aTestCoverageFunctionalityDirectNIOAndPrimitiveArray
    [junit] Testing accessing PointerBuffer values [0..7]
    [junit]   0/8: 0x7fc249dd1c30
    [junit]   1/8: 0x7fc249dd1c70
    [junit]   2/8: 0x7fc249dd1cb0
    [junit]   3/8: 0x7fc249dd1cf0
    [junit]   4/8: 0x7fc249dd1d30
    [junit]   5/8: 0x7fc249dd1d70
    [junit]   6/8: 0x7fc249dd1db0
    [junit]   7/8: 0x7fc249dd1df0
    [junit] Testing accessing PointerBuffer values [0..7]
    [junit]   0/8: 0x7fc249dd1c30
    [junit]   1/8: 0x7fc249dd1c70
    [junit]   2/8: 0x7fc249dd1cb0
    [junit]   3/8: 0x7fc249dd1cf0
    [junit]   4/8: 0x7fc249dd1d30
    [junit]   5/8: 0x7fc249dd1d70
    [junit]   6/8: 0x7fc249dd1db0
    [junit]   7/8: 0x7fc249dd1df0
    [junit] Testing accessing PointerBuffer values [0..7]
    [junit]   0/8: 0x7fc249d68c80
    [junit]   1/8: 0x7fc249dd1a90
    [junit]   2/8: 0x7fc249dd1ad0
    [junit]   3/8: 0x7fc249dd1b10
    [junit]   4/8: 0x7fc249dd1b50
    [junit]   5/8: 0x7fc249dd7050
    [junit]   6/8: 0x7fc249dd7090
    [junit]   7/8: 0x7fc249dd70d0
    [junit] Testing accessing PointerBuffer values [0..7]
    [junit]   0/8: 0x7fc249d68c80
    [junit]   1/8: 0x7fc249dd1a90
    [junit]   2/8: 0x7fc249dd1ad0
    [junit]   3/8: 0x7fc249dd1b10
    [junit]   4/8: 0x7fc249dd1b50
    [junit]   5/8: 0x7fc249dd7050
    [junit]   6/8: 0x7fc249dd7090
    [junit]   7/8: 0x7fc249dd70d0
    [junit] Testing accessing PointerBuffer values [0..7]
    [junit]   0/8: 0x7fc24c00f4d0
    [junit]   1/8: 0x7fc24c00f510
    [junit]   2/8: 0x7fc24c00f550
    [junit]   3/8: 0x7fc24c00f590
    [junit]   4/8: 0x7fc249d59ab0
    [junit]   5/8: 0x7fc249d59af0
    [junit]   6/8: 0x7fc249d59b30
    [junit]   7/8: 0x7fc249d59b70
    [junit] Testing accessing PointerBuffer values [0..7]
    [junit]   0/8: 0x7fc249dd4290
    [junit]   1/8: 0x7fc249d633b0
    [junit]   2/8: 0x7fc249d633f0
    [junit]   3/8: 0x7fc249d9f970
    [junit]   4/8: 0x7fc249d9f9b0
    [junit]   5/8: 0x7fc249d9f9f0
    [junit]   6/8: 0x7fc249ddbe90
    [junit]   7/8: 0x7fc249ddbed0
    [junit] Testing accessing PointerBuffer values [0..7]
    [junit]   0/8: 0x7fc249dd4290
    [junit]   1/8: 0x7fc249d633b0
    [junit]   2/8: 0x7fc249d633f0
    [junit]   3/8: 0x7fc249d9f970
    [junit]   4/8: 0x7fc249d9f9b0
    [junit]   5/8: 0x7fc249d9f9f0
    [junit]   6/8: 0x7fc249ddbe90
    [junit]   7/8: 0x7fc249ddbed0
    [junit] Testing accessing PointerBuffer values [0..7]
    [junit]   0/8: 0x7fc249d59bb0
    [junit]   1/8: 0x7fc249d59bb0
    [junit]   2/8: 0x7fc249d59bb0
    [junit]   3/8: 0x7fc249d59bb0
    [junit]   4/8: 0x7fc249d59bb0
    [junit]   5/8: 0x7fc249d59bb0
    [junit]   6/8: 0x7fc249d59bb0
    [junit]   7/8: 0x7fc249d59bb0
    [junit] Testing accessing PointerBuffer values [0..7]
    [junit]   0/8: 0x4
    [junit]   1/8: 0x4
    [junit]   2/8: 0x4
    [junit]   3/8: 0x4
    [junit]   4/8: 0x4
    [junit]   5/8: 0x4
    [junit]   6/8: 0x4
    [junit]   7/8: 0x4
    [junit] ++++ TestCase.tearDown: com.jogamp.gluegen.test.junit.generation.Test1p2ProcAddressEmitter - chapter03aTestCoverageFunctionalityDirectNIOAndPrimitiveArray
    [junit] ++++ TestCase.setUp: com.jogamp.gluegen.test.junit.generation.Test1p2ProcAddressEmitter - chapter03bTestCoverageFunctionalityIndirectNIOAndPrimitiveArray
    [junit] Testing accessing PointerBuffer values [0..7]
    [junit]   0/8: 0x11f92c238
    [junit]   1/8: 0x11f92c278
    [junit]   2/8: 0x11f92c2b8
    [junit]   3/8: 0x11f92c2f8
    [junit]   4/8: 0x11f92c338
    [junit]   5/8: 0x11f92c378
    [junit]   6/8: 0x11f92c3b8
    [junit]   7/8: 0x11f92c3f8
    [junit] Testing accessing PointerBuffer values [0..7]
    [junit]   0/8: 0x11f92c238
    [junit]   1/8: 0x11f92c278
    [junit]   2/8: 0x11f92c2b8
    [junit]   3/8: 0x11f92c2f8
    [junit]   4/8: 0x11f92c338
    [junit]   5/8: 0x11f92c378
    [junit]   6/8: 0x11f92c3b8
    [junit]   7/8: 0x11f92c3f8
    [junit] Testing accessing PointerBuffer values [0..7]
    [junit]   0/8: 0x7fc249d84bf0
    [junit]   1/8: 0x7fc249d84c30
    [junit]   2/8: 0x7fc249d84c70
    [junit]   3/8: 0x7fc249dab670
    [junit]   4/8: 0x7fc249dab6b0
    [junit]   5/8: 0x7fc249dab6f0
    [junit]   6/8: 0x7fc249dab730
    [junit]   7/8: 0x7fc249df5830
    [junit] Testing accessing PointerBuffer values [0..7]
    [junit]   0/8: 0x7fc249d84bf0
    [junit]   1/8: 0x7fc249d84c30
    [junit]   2/8: 0x7fc249d84c70
    [junit]   3/8: 0x7fc249dab670
    [junit]   4/8: 0x7fc249dab6b0
    [junit]   5/8: 0x7fc249dab6f0
    [junit]   6/8: 0x7fc249dab730
    [junit]   7/8: 0x7fc249df5830
    [junit] Testing accessing PointerBuffer values [0..7]
    [junit]   0/8: 0x7fc249df5870
    [junit]   1/8: 0x7fc249df58b0
    [junit]   2/8: 0x7fc249df58f0
    [junit]   3/8: 0x7fc249dfba70
    [junit]   4/8: 0x7fc249ccfa00
    [junit]   5/8: 0x7fc249ccfa40
    [junit]   6/8: 0x7fc249cc7ee0
    [junit]   7/8: 0x7fc249cc7f20
    [junit] Testing accessing PointerBuffer values [0..7]
    [junit]   0/8: 0x7fc249cc7f60
    [junit]   1/8: 0x7fc249cc7fa0
    [junit]   2/8: 0x7fc249c77650
    [junit]   3/8: 0x7fc249c77690
    [junit]   4/8: 0x7fc249c776d0
    [junit]   5/8: 0x7fc249c77710
    [junit]   6/8: 0x7fc249cd20e0
    [junit]   7/8: 0x7fc249cd2120
    [junit] Testing accessing PointerBuffer values [0..7]
    [junit]   0/8: 0x7fc249cc7f60
    [junit]   1/8: 0x7fc249cc7fa0
    [junit]   2/8: 0x7fc249c77650
    [junit]   3/8: 0x7fc249c77690
    [junit]   4/8: 0x7fc249c776d0
    [junit]   5/8: 0x7fc249c77710
    [junit]   6/8: 0x7fc249cd20e0
    [junit]   7/8: 0x7fc249cd2120
    [junit] Testing accessing PointerBuffer values [0..7]
    [junit]   0/8: 0x7fc249ccfa80
    [junit]   1/8: 0x7fc249ccfa80
    [junit]   2/8: 0x7fc249ccfa80
    [junit]   3/8: 0x7fc249ccfa80
    [junit]   4/8: 0x7fc249ccfa80
    [junit]   5/8: 0x7fc249ccfa80
    [junit]   6/8: 0x7fc249ccfa80
    [junit]   7/8: 0x7fc249ccfa80
    [junit] Testing accessing PointerBuffer values [0..7]
    [junit]   0/8: 0x4
    [junit]   1/8: 0x4
    [junit]   2/8: 0x4
    [junit]   3/8: 0x4
    [junit]   4/8: 0x4
    [junit]   5/8: 0x4
    [junit]   6/8: 0x4
    [junit]   7/8: 0x4
    [junit] ++++ TestCase.tearDown: com.jogamp.gluegen.test.junit.generation.Test1p2ProcAddressEmitter - chapter03bTestCoverageFunctionalityIndirectNIOAndPrimitiveArray
    [junit] ++++ TestCase.setUp: com.jogamp.gluegen.test.junit.generation.Test1p2ProcAddressEmitter - chapter04TestPointerBuffer
    [junit] Testing accessing PointerBuffer values [0..0]
    [junit]   0/1: 0xdeadbeef
    [junit] Testing accessing PointerBuffer values [0..0]
    [junit]   0/1: 0xdeadbeef
    [junit] Testing accessing PointerBuffer values [0..0]
    [junit]   0/1: 0xdeadbeef
    [junit] Testing accessing PointerBuffer values [0..0]
    [junit]   0/1: 0xdeadbeef
    [junit] Testing accessing PointerBuffer values [0..0]
    [junit]   0/1: 0xdeadbeef
    [junit] Testing accessing PointerBuffer values [0..0]
    [junit]   0/1: 0xdeadbeef
    [junit] Testing accessing PointerBuffer values [0..0]
    [junit]   0/1: 0xdeadbeef
    [junit] Testing accessing PointerBuffer values [0..0]
    [junit]   0/1: 0xdeadbeef
    [junit] ++++ TestCase.tearDown: com.jogamp.gluegen.test.junit.generation.Test1p2ProcAddressEmitter - chapter04TestPointerBuffer
    [junit] ++++ TestCase.setUp: com.jogamp.gluegen.test.junit.generation.Test1p2ProcAddressEmitter - chapter05TestSomeFunctionsAllIndirect
    [junit] ArrayCopy.01: [1, 2, 3, 4, 5, 6, 7, 8, 9, 0]
    [junit] ArrayCopy.02: [1, 2, 3, 4, 5, 6, 7, 8, 9, 0], java.nio.HeapIntBuffer[pos=0 lim=10 cap=10]
    [junit] ArrayCopy.03: [4, 5, 6, 7]
    [junit] ArrayCopy.04: [0, 0, 0, 4, 5, 6, 7, 0, 0, 0]
    [junit] ArrayCopy.05: [0, 0, 0, 4, 5, 6, 7, 0, 0, 0], java.nio.HeapIntBuffer[pos=0 lim=10 cap=10]
    [junit] ++++ TestCase.tearDown: com.jogamp.gluegen.test.junit.generation.Test1p2ProcAddressEmitter - chapter05TestSomeFunctionsAllIndirect
    [junit] ++++ TestCase.setUp: com.jogamp.gluegen.test.junit.generation.Test1p2ProcAddressEmitter - chapter09TestCompoundAlignment
    [junit] static  md: MachineDescriptionStatic: X86_64_UNIX(2): MachineDescription: runtimeValidated false, littleEndian true, 32Bit false, primitive size / alignment:
    [junit]   int8    1 / 1, int16   2 / 2
    [junit]   int     4 / 4, long    8 / 8
    [junit]   int32   4 / 4, int64   8 / 8
    [junit]   float   4 / 4, double  8 / 8, ldouble 16 / 16
    [junit]   pointer 8 / 8, page    4096
    [junit] runtime md: MachineDescription: runtimeValidated true, littleEndian true, 32Bit false, primitive size / alignment:
    [junit]   int8    1 / 1, int16   2 / 2
    [junit]   int     4 / 4, long    8 / 8
    [junit]   int32   4 / 4, int64   8 / 8
    [junit]   float   4 / 4, double  8 / 8, ldouble 16 / 16
    [junit]   pointer 8 / 8, page    4096
    [junit] compatible static/runtime: true
    [junit] ++++ TestCase.tearDown: com.jogamp.gluegen.test.junit.generation.Test1p2ProcAddressEmitter - chapter09TestCompoundAlignment
    [junit] ++++ TestCase.setUp: com.jogamp.gluegen.test.junit.generation.Test1p2ProcAddressEmitter - chapter10TestCompoundCallByReference
    [junit] 0x123456789abcdef0 == 0x123456789abcdef0
    [junit] 0xa23456781abcdef0 == 0xa23456781abcdef0
    [junit] 0xb23456782abcdef0 == 0xb23456782abcdef0
    [junit] 0x123456789abcdef0 == 0x123456789abcdef0
    [junit] 0xa23456781abcdef0 == 0xa23456781abcdef0
    [junit] 0xb23456782abcdef0 == 0xb23456782abcdef0
    [junit] 0x123456789abcdef0 == 0x123456789abcdef0
    [junit] 0xa23456781abcdef0 == 0xa23456781abcdef0
    [junit] 0xb23456782abcdef0 == 0xb23456782abcdef0
    [junit] 0x123456789abcdef0 == 0x123456789abcdef0
    [junit] 0xa23456781abcdef0 == 0xa23456781abcdef0
    [junit] 0xb23456782abcdef0 == 0xb23456782abcdef0
    [junit] ch10: ref-dim 286331153/572662306 858993459x1145324612
    [junit] ++++ TestCase.tearDown: com.jogamp.gluegen.test.junit.generation.Test1p2ProcAddressEmitter - chapter10TestCompoundCallByReference
    [junit] ++++ TestCase.setUp: com.jogamp.gluegen.test.junit.generation.Test1p2ProcAddressEmitter - chapter11TestCompoundCallByValue
    [junit] ch11.0: ref-dim 286331153/572662306 858993459x1145324612
    [junit] ch11.0: val-dim 286331153/572662306 858993459x1145324612
    [junit] ch11.1: val-dim 11/22 33x44
    [junit] ch11.2: val-dim 11/22 33x44
    [junit] ch11.3: sameInstanceByVal false
    [junit] ch11.3: sameInstanceByRef false
    [junit] ch11.4: sum-dimArray 12/24 36x48
    [junit] ch11.5: dimsGet[0] 11/22 33x44
    [junit] ch11.5: dimsGet[1] 1/2 3x4
    [junit] ch11.6: sum-dimPair 12/24 36x48
    [junit] ch11.7: zero-dim[0] 0/0 0x0
    [junit] ch11.7: zero-dim[1] 0/0 0x0
    [junit] ch11.8: copyPrim2Dim 11/22 100x200
    [junit] ch11.9: copyDim2Prim 11/22 100x200
    [junit] ch11.10: expRGBAb 0x11, 0x22, 0x33, 0xffffffaa
    [junit] ch11.10: hasRGBAi 0x112233aa
    [junit] ch11.11: hasRGBAb 0x11, 0x22, 0x33, 0xffffffaa
    [junit] ch11.12: addInt 3
    [junit] ch11.13: addByte 3
    [junit] ++++ TestCase.tearDown: com.jogamp.gluegen.test.junit.generation.Test1p2ProcAddressEmitter - chapter11TestCompoundCallByValue
    [junit] ++++ TestCase.setUp: com.jogamp.gluegen.test.junit.generation.Test1p2ProcAddressEmitter - chapter12TestStructArrayModelConst
    [junit] 0x123456789abcdef0 == 0x123456789abcdef0
    [junit] 0x123456789abcdef0 == 0x123456789abcdef0
    [junit] has 'Hello Array'
    [junit] has   0: 0x48 H
    [junit] has   1: 0x65 e
    [junit] has   2: 0x6C l
    [junit] has   3: 0x6C l
    [junit] has   4: 0x6F o
    [junit] has   5: 0x20  
    [junit] has   6: 0x41 A
    [junit] has   7: 0x72 r
    [junit] has   8: 0x72 r
    [junit] has   9: 0x61 a
    [junit] has  10: 0x79 y
    [junit] has 'Hello CString'
    [junit] has   0: 0x48 H
    [junit] has   1: 0x65 e
    [junit] has   2: 0x6C l
    [junit] has   3: 0x6C l
    [junit] has   4: 0x6F o
    [junit] has   5: 0x20  
    [junit] has   6: 0x43 C
    [junit] has   7: 0x53 S
    [junit] has   8: 0x74 t
    [junit] has   9: 0x72 r
    [junit] has  10: 0x69 i
    [junit] has  11: 0x6E n
    [junit] has  12: 0x67 g
    [junit] has 'Hello Pointer'
    [junit] has   0: 0x48 H
    [junit] has   1: 0x65 e
    [junit] has   2: 0x6C l
    [junit] has   3: 0x6C l
    [junit] has   4: 0x6F o
    [junit] has   5: 0x20  
    [junit] has   6: 0x50 P
    [junit] has   7: 0x6F o
    [junit] has   8: 0x69 i
    [junit] has   9: 0x6E n
    [junit] has  10: 0x74 t
    [junit] has  11: 0x65 e
    [junit] has  12: 0x72 r
    [junit] ++++ TestCase.tearDown: com.jogamp.gluegen.test.junit.generation.Test1p2ProcAddressEmitter - chapter12TestStructArrayModelConst
    [junit] ++++ TestCase.setUp: com.jogamp.gluegen.test.junit.generation.Test1p2ProcAddressEmitter - chapter13TestStructArrayModelMutable
    [junit] 0x123456789abcdef0 == 0x123456789abcdef0
    [junit] 0x123456789abcdef0 == 0x123456789abcdef0
    [junit] ++++ TestCase.tearDown: com.jogamp.gluegen.test.junit.generation.Test1p2ProcAddressEmitter - chapter13TestStructArrayModelMutable
    [junit] ------------- ---------------- ---------------
    [junit] ++++ TestCase.setUp: com.jogamp.gluegen.test.junit.structgen.TestStructGen01 - test01
    [junit] ++++ TestCase.tearDown: com.jogamp.gluegen.test.junit.structgen.TestStructGen01 - test01
    [junit] ++++ TestCase.setUp: com.jogamp.gluegen.test.junit.structgen.TestStructGen01 - test02
    [junit] ++++ TestCase.tearDown: com.jogamp.gluegen.test.junit.structgen.TestStructGen01 - test02
    [junit] Testsuite: com.jogamp.gluegen.test.junit.structgen.TestStructGen01
    [junit] Testsuite: com.jogamp.gluegen.test.junit.structgen.TestStructGen01
    [junit] Tests run: 2, Failures: 0, Errors: 0, Time elapsed: 0.083 sec
    [junit] ------------- Standard Error -----------------
    [junit] ++++ TestCase.setUp: com.jogamp.gluegen.test.junit.structgen.TestStructGen01 - test01
    [junit] ++++ TestCase.tearDown: com.jogamp.gluegen.test.junit.structgen.TestStructGen01 - test01
    [junit] ++++ TestCase.setUp: com.jogamp.gluegen.test.junit.structgen.TestStructGen01 - test02
    [junit] ++++ TestCase.tearDown: com.jogamp.gluegen.test.junit.structgen.TestStructGen01 - test02
    [junit] ------------- ---------------- ---------------
    [junit] 
    [junit] Testcase: test01 took 0.002 sec
    [junit] Testcase: test02 took 0 sec
    [junit] Tests run: 2, Failures: 0, Errors: 0, Time elapsed: 0.083 sec
    [junit] 
    [junit] ------------- Standard Error -----------------
    [junit] ++++ TestCase.setUp: com.jogamp.gluegen.test.junit.structgen.TestStructGen01 - test01
    [junit] ++++ TestCase.tearDown: com.jogamp.gluegen.test.junit.structgen.TestStructGen01 - test01
    [junit] ++++ TestCase.setUp: com.jogamp.gluegen.test.junit.structgen.TestStructGen01 - test02
    [junit] ++++ TestCase.tearDown: com.jogamp.gluegen.test.junit.structgen.TestStructGen01 - test02
    [junit] ------------- ---------------- ---------------
    [junit] Testsuite: com.jogamp.gluegen.test.junit.structgen.TestStructGen02
    [junit] Testsuite: com.jogamp.gluegen.test.junit.structgen.TestStructGen02
    [junit] ++++ TestCase.setUp: com.jogamp.gluegen.test.junit.structgen.TestStructGen02 - test01
    [junit] ++++ TestCase.tearDown: com.jogamp.gluegen.test.junit.structgen.TestStructGen02 - test01
    [junit] No SecurityManager Installed
    [junit] ++++ TestCase.setUp: com.jogamp.junit.sec.TestSecIOUtil01 - testProp00_Temp
    [junit] os.name: Mac OS X
    [junit] ++++ TestCase.tearDown: com.jogamp.junit.sec.TestSecIOUtil01 - testProp00_Temp
    [junit] Tests run: 1, Failures: 0, Errors: 0, Time elapsed: 0.063 sec
    [junit] ------------- Standard Error -----------------
    [junit] ++++ TestCase.setUp: com.jogamp.gluegen.test.junit.structgen.TestStructGen02 - test01
    [junit] ++++ TestCase.tearDown: com.jogamp.gluegen.test.junit.structgen.TestStructGen02 - test01
    [junit] ------------- ---------------- ---------------
    [junit] 
    [junit] Testcase: test01 took 0.002 sec
    [junit] Tests run: 1, Failures: 0, Errors: 0, Time elapsed: 0.063 sec
    [junit] 
    [junit] ------------- Standard Error -----------------
    [junit] ++++ TestCase.setUp: com.jogamp.gluegen.test.junit.structgen.TestStructGen02 - test01
    [junit] ++++ TestCase.tearDown: com.jogamp.gluegen.test.junit.structgen.TestStructGen02 - test01
    [junit] ------------- ---------------- ---------------
    [junit] Testsuite: com.jogamp.junit.sec.TestSecIOUtil01
    [junit] Testsuite: com.jogamp.junit.sec.TestSecIOUtil01
    [junit] ++++ TestCase.setUp: com.jogamp.junit.sec.TestSecIOUtil01 - testProp01_Temp
    [junit] java.home: /Library/Java/JavaVirtualMachines/jdk1.7.0_60.jdk/Contents/Home/jre
    [junit] ++++ TestCase.tearDown: com.jogamp.junit.sec.TestSecIOUtil01 - testProp01_Temp
    [junit] ++++ TestCase.setUp: com.jogamp.junit.sec.TestSecIOUtil01 - testProp02_Temp
    [junit] java.io.tmpdir: /var/folders/2z/qqs9pzgx5bzgw_nxz34mxg4m0000gp/T/
    [junit] ++++ TestCase.tearDown: com.jogamp.junit.sec.TestSecIOUtil01 - testProp02_Temp
    [junit] ++++ TestCase.setUp: com.jogamp.junit.sec.TestSecIOUtil01 - testTempDir00
    [junit] Temp: /var/folders/2z/qqs9pzgx5bzgw_nxz34mxg4m0000gp/T/jogamp_0000
    [junit] ++++ TestCase.tearDown: com.jogamp.junit.sec.TestSecIOUtil01 - testTempDir00
    [junit] Tests run: 4, Failures: 0, Errors: 0, Time elapsed: 0.178 sec
    [junit] ------------- Standard Error -----------------
    [junit] No SecurityManager Installed
    [junit] ++++ TestCase.setUp: com.jogamp.junit.sec.TestSecIOUtil01 - testProp00_Temp
    [junit] os.name: Mac OS X
    [junit] ++++ TestCase.tearDown: com.jogamp.junit.sec.TestSecIOUtil01 - testProp00_Temp
    [junit] ++++ TestCase.setUp: com.jogamp.junit.sec.TestSecIOUtil01 - testProp01_Temp
    [junit] java.home: /Library/Java/JavaVirtualMachines/jdk1.7.0_60.jdk/Contents/Home/jre
    [junit] ++++ TestCase.tearDown: com.jogamp.junit.sec.TestSecIOUtil01 - testProp01_Temp
    [junit] ++++ TestCase.setUp: com.jogamp.junit.sec.TestSecIOUtil01 - testProp02_Temp
    [junit] java.io.tmpdir: /var/folders/2z/qqs9pzgx5bzgw_nxz34mxg4m0000gp/T/
    [junit] ++++ TestCase.tearDown: com.jogamp.junit.sec.TestSecIOUtil01 - testProp02_Temp
    [junit] ++++ TestCase.setUp: com.jogamp.junit.sec.TestSecIOUtil01 - testTempDir00
    [junit] Temp: /var/folders/2z/qqs9pzgx5bzgw_nxz34mxg4m0000gp/T/jogamp_0000
    [junit] ++++ TestCase.tearDown: com.jogamp.junit.sec.TestSecIOUtil01 - testTempDir00
    [junit] ------------- ---------------- ---------------
    [junit] 
    [junit] Testcase: testProp00_Temp took 0 sec
    [junit] Testcase: testProp01_Temp took 0 sec
    [junit] Testcase: testProp02_Temp took 0 sec
    [junit] Testcase: testTempDir00 took 0 sec
    [junit] Tests run: 4, Failures: 0, Errors: 0, Time elapsed: 0.178 sec
    [junit] 
    [junit] ------------- Standard Error -----------------
    [junit] No SecurityManager Installed
    [junit] ++++ TestCase.setUp: com.jogamp.junit.sec.TestSecIOUtil01 - testProp00_Temp
    [junit] os.name: Mac OS X
    [junit] ++++ TestCase.tearDown: com.jogamp.junit.sec.TestSecIOUtil01 - testProp00_Temp
    [junit] ++++ TestCase.setUp: com.jogamp.junit.sec.TestSecIOUtil01 - testProp01_Temp
    [junit] java.home: /Library/Java/JavaVirtualMachines/jdk1.7.0_60.jdk/Contents/Home/jre
    [junit] ++++ TestCase.tearDown: com.jogamp.junit.sec.TestSecIOUtil01 - testProp01_Temp
    [junit] ++++ TestCase.setUp: com.jogamp.junit.sec.TestSecIOUtil01 - testProp02_Temp
    [junit] java.io.tmpdir: /var/folders/2z/qqs9pzgx5bzgw_nxz34mxg4m0000gp/T/
    [junit] ++++ TestCase.tearDown: com.jogamp.junit.sec.TestSecIOUtil01 - testProp02_Temp
    [junit] ++++ TestCase.setUp: com.jogamp.junit.sec.TestSecIOUtil01 - testTempDir00
    [junit] Temp: /var/folders/2z/qqs9pzgx5bzgw_nxz34mxg4m0000gp/T/jogamp_0000
    [junit] ++++ TestCase.tearDown: com.jogamp.junit.sec.TestSecIOUtil01 - testTempDir00
    [junit] ------------- ---------------- ---------------
    [junit] Tests FAILED

junit.run.remote.ssh:

junit.run.remote.adb:

junit.run.tests:

junit.run.if.disabled:

junit.run:
     [echo] gluegen.basename: gluegen

jogamp.env.validation:
     [echo] ant.version                Apache Ant(TM) version 1.8.2 compiled on December 20 2010
     [echo] ant.java.version           1.7
     [echo] java.version               1.7.0_60
     [echo] java.home                  /Library/Java/JavaVirtualMachines/jdk1.7.0_60.jdk/Contents/Home/jre
     [echo] jvmJava.exe                /Library/Java/JavaVirtualMachines/jdk1.7.0_60.jdk/Contents/Home/jre/bin/java
     [echo] jvmJava7.exe               ${jvmJava7.exe}

jogamp.env.init:
     [echo] jogamp.jar.codebase        Codebase: *.jogamp.org
     [echo] jogamp.version             2.2.1-rc-20140831
     [echo] jogamp.version.int         0914019
     [echo] junit.is.disabled          ${junit.is.disabled}
     [echo] target.user.set            true
     [echo] target.sourcelevel         1.6
     [echo] target.targetlevel         1.6
     [echo] target.rt.jar              /opt-share/jre1.6.0_30/lib/rt.jar
     [echo] host.sourcelevel           1.7
     [echo] host.targetlevel           1.7
     [echo] host.rt.jar                /Library/Java/JavaVirtualMachines/jdk1.7.0_60.jdk/Contents/Home/jre/lib/rt.jar
     [echo] javacdebug                 true
     [echo] javacdebuglevel            source,lines
     [echo] javac.memorymax            1024m
     [echo] build.archiveon            ${build.archiveon}
     [echo] build.node.name            macosx64-NV320M-10_7-jogamp-x64-jre7-sgothel-013
     [echo] android.version            9
     [echo] junit.run.arg0             -Djunit.run.arg0=dummy
     [echo] junit.run.arg1             -Djunit.run.arg1=dummy
     [echo] macosx.sdkroot             ${macosx.sdkroot}

gluegen.properties.load.user:

init:

java.class.path.validate:

validate:
     [echo] test.base.dir: ../src/junit 
     [echo] test.junit.generation.dir: ../src/junit/com/jogamp/gluegen/test/junit/generation 
     [echo] test.dir: ../build/test 
     [echo] results: ../build/test/results 
     [echo] build_t: ../build/test/build 
     [echo] build_t.gen: ../build/test/build/gensrc 
     [echo] build_t.java: ../build/test/build/classes 
     [echo] build_t.obj: ../build/test/build/obj 
     [echo] build_t.lib: ../build/test/build/natives 

test-zip-archive:
     [exec] 
     [exec] 7-Zip [64] 9.13 beta  Copyright (c) 1999-2010 Igor Pavlov  2010-04-15
     [exec] p7zip Version 9.13 (locale=utf8,Utf16=on,HugeFiles=on,2 CPUs)
     [exec] Scanning
     [exec] 
     [exec] Creating archive /Users/jogamp/JogAmpSlavex64_jre7/workspace/gluegen/label/macosx-10_7-x86_64-nvidia_jre7/build/gluegen-2.2-b817-20140831-macosx-universal-test-results-macosx64-NV320M-10_7-jogamp-x64-jre7-sgothel-013.7z
     [exec] 
     [exec] Compressing  build/test/results/TEST-com.jogamp.common.net.AssetURLConnectionRegisteredTest.xml
     [exec] Compressing  build/test/results/TEST-com.jogamp.common.net.AssetURLConnectionUnregisteredTest.xml
     [exec] Compressing  build/test/results/TEST-com.jogamp.common.net.TestURIQueryProps.xml
     [exec] Compressing  build/test/results/TEST-com.jogamp.common.net.TestUrisWithAssetHandler.xml
     [exec] Compressing  build/test/results/TEST-com.jogamp.common.nio.BuffersTest.xml
     [exec] Compressing  build/test/results/TEST-com.jogamp.common.nio.CachedBufferFactoryTest.xml
     [exec] Compressing  build/test/results/TEST-com.jogamp.common.nio.TestBuffersFloatDoubleConversion.xml
     [exec] Compressing  build/test/results/TEST-com.jogamp.common.nio.TestPointerBufferEndian.xml
     [exec] Compressing  build/test/results/TEST-com.jogamp.common.nio.TestStructAccessorEndian.xml
     [exec] Compressing  build/test/results/TEST-com.jogamp.common.os.TestElfReader01.xml
     [exec] Compressing  build/test/results/TEST-com.jogamp.common.util.IntIntHashMapTest.xml
     [exec] Compressing  build/test/results/TEST-com.jogamp.common.util.IntObjectHashMapTest.xml
     [exec] Compressing  build/test/results/TEST-com.jogamp.common.util.locks.TestRecursiveLock01.xml
     [exec] Compressing  build/test/results/TEST-com.jogamp.common.util.locks.TestRecursiveThreadGroupLock01.xml
     [exec] Compressing  build/test/results/TEST-com.jogamp.common.util.locks.TestSingletonServerSocket00.xml
     [exec] Compressing  build/test/results/TEST-com.jogamp.common.util.locks.TestSingletonServerSocket01.xml
     [exec] Compressing  build/test/results/TEST-com.jogamp.common.util.locks.TestSingletonServerSocket02.xml
     [exec] Compressing  build/test/results/TEST-com.jogamp.common.util.LongIntHashMapTest.xml
     [exec] Compressing  build/test/results/TEST-com.jogamp.common.util.TestArrayHashSet01.xml
     [exec] Compressing  build/test/results/TEST-com.jogamp.common.util.TestBitstream00.xml
     [exec] Compressing  build/test/results/TEST-com.jogamp.common.util.TestBitstream01.xml
     [exec] Compressing  build/test/results/TEST-com.jogamp.common.util.TestBitstream02.xml
     [exec] Compressing  build/test/results/TEST-com.jogamp.common.util.TestBitstream03.xml
     [exec] Compressing  build/test/results/TEST-com.jogamp.common.util.TestBitstream04.xml
     [exec] Compressing  build/test/results/TEST-com.jogamp.common.util.TestFloatStack01.xml
     [exec] Compressing  build/test/results/TEST-com.jogamp.common.util.TestIntegerStack01.xml
     [exec] Compressing  build/test/results/TEST-com.jogamp.common.util.TestIOUtil01.xml
     [exec] Compressing  build/test/results/TEST-com.jogamp.common.util.TestIOUtilURICompose.xml
     [exec] Compressing  build/test/results/TEST-com.jogamp.common.util.TestIOUtilURIHandling.xml
     [exec] Compressing  build/test/results/TEST-com.jogamp.common.util.TestIteratorIndexCORE.xml
     [exec] Compressing  build/test/results/TEST-com.jogamp.common.util.TestJarUtil.xml
     [exec] Compressing  build/test/results/TEST-com.jogamp.common.util.TestLFRingBuffer01.xml
     [exec] Compressing  build/test/results/TEST-com.jogamp.common.util.TestPlatform01.xml
     [exec] Compressing  build/test/results/TEST-com.jogamp.common.util.TestRunnableTask01.xml
     [exec] Compressing  build/test/results/TEST-com.jogamp.common.util.TestSyncRingBuffer01.xml
     [exec] Compressing  build/test/results/TEST-com.jogamp.common.util.TestSystemPropsAndEnvs.xml
     [exec] Compressing  build/test/results/TEST-com.jogamp.common.util.TestTempJarCache.xml
     [exec] Compressing  build/test/results/TEST-com.jogamp.common.util.TestValueConversion.xml
     [exec] Compressing  build/test/results/TEST-com.jogamp.common.util.TestVersionInfo.xml
     [exec] Compressing  build/test/results/TEST-com.jogamp.common.util.TestVersionNumber.xml
     [exec] Compressing  build/test/results/TEST-com.jogamp.common.util.TestVersionSemantics.xml
     [exec] Compressing  build/test/results/TEST-com.jogamp.gluegen.test.junit.generation.PCPPTest.xml
     [exec] Compressing  build/test/results/TEST-com.jogamp.gluegen.test.junit.generation.Test1p1JavaEmitter.xml
     [exec] Compressing  build/test/results/TEST-com.jogamp.gluegen.test.junit.generation.Test1p2LoadJNIAndImplLib.xml
     [exec] Compressing  build/test/results/TEST-com.jogamp.gluegen.test.junit.generation.Test1p2ProcAddressEmitter.xml
     [exec] Compressing  build/test/results/TEST-com.jogamp.gluegen.test.junit.structgen.TestStructGen01.xml
     [exec] Compressing  build/test/results/TEST-com.jogamp.gluegen.test.junit.structgen.TestStructGen02.xml
     [exec] Compressing  build/test/results/TEST-com.jogamp.junit.sec.TestSecIOUtil01.xml
     [exec] 
     [exec] Everything is Ok

BUILD SUCCESSFUL
Total time: 2 minutes 10 seconds
[WARNINGS] Parsing warnings in console log with parser Java Compiler (javac)
Archiving artifacts
Recording test results
Build step 'Publish JUnit test result report' changed build result to UNSTABLE
[CopyArchiverPublisher] Copying archived artifacts in the shared directory '/srv/www/jogamp.org/deployment/autobuilds/origin/master/gluegen-b817-2014-08-31_21-08-19'.
[CopyArchiverPublisher] '2' artifacts have been copied.
[CopyArchiverPublisher] Stop copying archived artifacts in the shared directory.
Sending e-mails to: chuckslave@jogamp.org
No emails were triggered.
Notifying upstream projects of job completion
Finished: UNSTABLE