UnstableConsole Output

Skipping 459 KB.. Full Log
h arguments:
    [apply] 'c:\JogAmpSlavex32\workspace\jocl\label\win7-x86_32-amd\build\natives\jocl\libjocl.so'
    [apply] 
    [apply] The ' characters around the executable and arguments are
    [apply] not part of the command.
    [apply] Applied strip to 1 file and 0 directories.
  [antcall] Exiting c:\JogAmpSlavex32\workspace\jocl\label\win7-x86_32-amd\build.xml.

c.rename.lib.mingw:
     [move] Moving 1 file to c:\JogAmpSlavex32\workspace\jocl\label\win7-x86_32-amd\build\natives\jocl
     [move] Attempting to rename: c:\JogAmpSlavex32\workspace\jocl\label\win7-x86_32-amd\build\natives\jocl\libjocl.so to c:\JogAmpSlavex32\workspace\jocl\label\win7-x86_32-amd\build\natives\jocl\jocl.dll

c.compile.default:

-post-compile:

compile:

-pre-jar:

-pre-pre-jar:
    [mkdir] Created dir: c:\JogAmpSlavex32\workspace\jocl\label\win7-x86_32-amd\build\jar

-do-jar-with-manifest:
Skipped because property 'manifest.available+main.class-mkdist.available' set.

-do-jar-without-manifest:
Skipped because property 'manifest.available-mkdist.available' set.

-do-jar-with-mainclass:
Skipped because property 'manifest.available+main.class+mkdist.available' set.

-do-jar-with-libraries:
[pathconvert] Set property run.classpath.without.build.classes.dir = c:\JogAmpSlavex32\workspace\jocl\label\win7-x86_32-amd\build\jar\jocl.jar;c:\JogAmpSlavex32\workspace\gluegen\label\win7-x86_32-amd\build\gluegen-rt.jar;c:\JogAmpSlavex32\workspace\jogl\label\win7-x86_32-amd\build\jar\jogl-all.jar;
[pathconvert] Set property jar.classpath = lib/jocl.jar lib/gluegen-rt.jar lib/jogl-all.jar
Override ignored for property "jar.classpath"
 [copylibs] c:\JogAmpSlavex32\workspace\jocl\label\win7-x86_32-amd\build\jar\jocl.jar is a directory or can't be read. Not copying the libraries.
 [copylibs] Building jar: c:\JogAmpSlavex32\workspace\jocl\label\win7-x86_32-amd\build\jar\jocl.jar
 [copylibs] Manifest warning: "Name" attributes should not occur in the main section and must be the first element in all other sections: "Name: com/jogamp/opencl/llb/impl/"
 [copylibs] adding directory META-INF/
 [copylibs] adding entry META-INF/MANIFEST.MF
 [copylibs] adding directory com/
 [copylibs] adding directory com/jogamp/
 [copylibs] adding directory com/jogamp/common/
 [copylibs] adding directory com/jogamp/opencl/
 [copylibs] adding directory com/jogamp/opencl/gl/
 [copylibs] adding directory com/jogamp/opencl/impl/
 [copylibs] adding directory com/jogamp/opencl/llb/
 [copylibs] adding directory com/jogamp/opencl/llb/gl/
 [copylibs] adding directory com/jogamp/opencl/llb/impl/
 [copylibs] adding directory com/jogamp/opencl/spi/
 [copylibs] adding directory com/jogamp/opencl/util/
 [copylibs] adding directory com/jogamp/opencl/util/concurrent/
 [copylibs] adding entry com/jogamp/common/AutoCloseable.class
 [copylibs] adding entry com/jogamp/opencl/CLBuffer.class
 [copylibs] adding entry com/jogamp/opencl/CLCommandQueue$Mode.class
 [copylibs] adding entry com/jogamp/opencl/CLCommandQueue.class
 [copylibs] adding entry com/jogamp/opencl/CLContext$ErrorDispatcher.class
 [copylibs] adding entry com/jogamp/opencl/CLContext.class
 [copylibs] adding entry com/jogamp/opencl/CLDevice$Capabilities.class
 [copylibs] adding entry com/jogamp/opencl/CLDevice$FPConfig.class
 [copylibs] adding entry com/jogamp/opencl/CLDevice$GlobalMemCacheType.class
 [copylibs] adding entry com/jogamp/opencl/CLDevice$LocalMemType.class
 [copylibs] adding entry com/jogamp/opencl/CLDevice$Type.class
 [copylibs] adding entry com/jogamp/opencl/CLDevice.class
 [copylibs] adding entry com/jogamp/opencl/CLErrorHandler.class
 [copylibs] adding entry com/jogamp/opencl/CLEvent$1.class
 [copylibs] adding entry com/jogamp/opencl/CLEvent$CLEventInfoAccessor.class
 [copylibs] adding entry com/jogamp/opencl/CLEvent$CLEventProfilingInfoAccessor.class
 [copylibs] adding entry com/jogamp/opencl/CLEvent$CommandType.class
 [copylibs] adding entry com/jogamp/opencl/CLEvent$ExecutionStatus.class
 [copylibs] adding entry com/jogamp/opencl/CLEvent$ProfilingCommand.class
 [copylibs] adding entry com/jogamp/opencl/CLEvent.class
 [copylibs] adding entry com/jogamp/opencl/CLEventList$1.class
 [copylibs] adding entry com/jogamp/opencl/CLEventList$EventIterator.class
 [copylibs] adding entry com/jogamp/opencl/CLEventList.class
 [copylibs] adding entry com/jogamp/opencl/CLEventListener.class
 [copylibs] adding entry com/jogamp/opencl/CLException$1.class
 [copylibs] adding entry com/jogamp/opencl/CLException$CLBuildProgramFailureException.class
 [copylibs] adding entry com/jogamp/opencl/CLException$CLCompilerNotAvailableException.class
 [copylibs] adding entry com/jogamp/opencl/CLException$CLDeviceNotAvailableException.class
 [copylibs] adding entry com/jogamp/opencl/CLException$CLDeviceNotFoundException.class
 [copylibs] adding entry com/jogamp/opencl/CLException$CLExecStatusErrorForEventsInWaitListException.class
 [copylibs] adding entry com/jogamp/opencl/CLException$CLImageFormatMismatchException.class
 [copylibs] adding entry com/jogamp/opencl/CLException$CLImageFormatNotSupportedException.class
 [copylibs] adding entry com/jogamp/opencl/CLException$CLInvalidArgIndexException.class
 [copylibs] adding entry com/jogamp/opencl/CLException$CLInvalidArgSizeException.class
 [copylibs] adding entry com/jogamp/opencl/CLException$CLInvalidArgValueException.class
 [copylibs] adding entry com/jogamp/opencl/CLException$CLInvalidBinaryException.class
 [copylibs] adding entry com/jogamp/opencl/CLException$CLInvalidBufferSizeException.class
 [copylibs] adding entry com/jogamp/opencl/CLException$CLInvalidBuildOptionsException.class
 [copylibs] adding entry com/jogamp/opencl/CLException$CLInvalidCommandQueueException.class
 [copylibs] adding entry com/jogamp/opencl/CLException$CLInvalidContextException.class
 [copylibs] adding entry com/jogamp/opencl/CLException$CLInvalidDeviceException.class
 [copylibs] adding entry com/jogamp/opencl/CLException$CLInvalidDeviceTypeException.class
 [copylibs] adding entry com/jogamp/opencl/CLException$CLInvalidEventException.class
 [copylibs] adding entry com/jogamp/opencl/CLException$CLInvalidEventWaitListException.class
 [copylibs] adding entry com/jogamp/opencl/CLException$CLInvalidGLObjectException.class
 [copylibs] adding entry com/jogamp/opencl/CLException$CLInvalidGLSharegroupReferenceKhrException.class
 [copylibs] adding entry com/jogamp/opencl/CLException$CLInvalidGlobalOffsetException.class
 [copylibs] adding entry com/jogamp/opencl/CLException$CLInvalidGlobalWorkSizeException.class
 [copylibs] adding entry com/jogamp/opencl/CLException$CLInvalidHostPtrException.class
 [copylibs] adding entry com/jogamp/opencl/CLException$CLInvalidImageFormatDescriptorException.class
 [copylibs] adding entry com/jogamp/opencl/CLException$CLInvalidImageSizeException.class
 [copylibs] adding entry com/jogamp/opencl/CLException$CLInvalidKernelArgsException.class
 [copylibs] adding entry com/jogamp/opencl/CLException$CLInvalidKernelDefinitionException.class
 [copylibs] adding entry com/jogamp/opencl/CLException$CLInvalidKernelException.class
 [copylibs] adding entry com/jogamp/opencl/CLException$CLInvalidKernelNameException.class
 [copylibs] adding entry com/jogamp/opencl/CLException$CLInvalidMemObjectException.class
 [copylibs] adding entry com/jogamp/opencl/CLException$CLInvalidMipLevelException.class
 [copylibs] adding entry com/jogamp/opencl/CLException$CLInvalidOperationException.class
 [copylibs] adding entry com/jogamp/opencl/CLException$CLInvalidPlatformException.class
 [copylibs] adding entry com/jogamp/opencl/CLException$CLInvalidProgramException.class
 [copylibs] adding entry com/jogamp/opencl/CLException$CLInvalidProgramExecutableException.class
 [copylibs] adding entry com/jogamp/opencl/CLException$CLInvalidPropertyException.class
 [copylibs] adding entry com/jogamp/opencl/CLException$CLInvalidQueuePropertiesException.class
 [copylibs] adding entry com/jogamp/opencl/CLException$CLInvalidSamplerException.class
 [copylibs] adding entry com/jogamp/opencl/CLException$CLInvalidValueException.class
 [copylibs] adding entry com/jogamp/opencl/CLException$CLInvalidWorkDimensionException.class
 [copylibs] adding entry com/jogamp/opencl/CLException$CLInvalidWorkGroupSizeException.class
 [copylibs] adding entry com/jogamp/opencl/CLException$CLInvalidWorkItemSizeException.class
 [copylibs] adding entry com/jogamp/opencl/CLException$CLMapFailureException.class
 [copylibs] adding entry com/jogamp/opencl/CLException$CLMemCopyOverlapException.class
 [copylibs] adding entry com/jogamp/opencl/CLException$CLMemObjectAllocationFailureException.class
 [copylibs] adding entry com/jogamp/opencl/CLException$CLMisalignedSubBufferOffsetException.class
 [copylibs] adding entry com/jogamp/opencl/CLException$CLOutOfHostMemoryException.class
 [copylibs] adding entry com/jogamp/opencl/CLException$CLOutOfResourcesException.class
 [copylibs] adding entry com/jogamp/opencl/CLException$CLPlatformNotFoundKhrException.class
 [copylibs] adding entry com/jogamp/opencl/CLException$CLProfilingInfoNotAvailableException.class
 [copylibs] adding entry com/jogamp/opencl/CLException.class
 [copylibs] adding entry com/jogamp/opencl/CLImage$CLImageInfoAccessor.class
 [copylibs] adding entry com/jogamp/opencl/CLImage.class
 [copylibs] adding entry com/jogamp/opencl/CLImage2d.class
 [copylibs] adding entry com/jogamp/opencl/CLImage3d.class
 [copylibs] adding entry com/jogamp/opencl/CLImageFormat$ChannelOrder.class
 [copylibs] adding entry com/jogamp/opencl/CLImageFormat$ChannelType.class
 [copylibs] adding entry com/jogamp/opencl/CLImageFormat.class
 [copylibs] adding entry com/jogamp/opencl/CLKernel.class
 [copylibs] adding entry com/jogamp/opencl/CLMemObjectListener.class
 [copylibs] adding entry com/jogamp/opencl/CLMemory$1.class
 [copylibs] adding entry com/jogamp/opencl/CLMemory$GLObjectType.class
 [copylibs] adding entry com/jogamp/opencl/CLMemory$Map.class
 [copylibs] adding entry com/jogamp/opencl/CLMemory$Mem.class
 [copylibs] adding entry com/jogamp/opencl/CLMemory.class
 [copylibs] adding entry com/jogamp/opencl/CLObject.class
 [copylibs] adding entry com/jogamp/opencl/CLObjectResource.class
 [copylibs] adding entry com/jogamp/opencl/CLPlatform.class
 [copylibs] adding entry com/jogamp/opencl/CLProgram$1.class
 [copylibs] adding entry com/jogamp/opencl/CLProgram$CompilerOptions.class
 [copylibs] adding entry com/jogamp/opencl/CLProgram$Status.class
 [copylibs] adding entry com/jogamp/opencl/CLProgram.class
 [copylibs] adding entry com/jogamp/opencl/CLProgramBuilder.class
 [copylibs] adding entry com/jogamp/opencl/CLProperty.class
 [copylibs] adding entry com/jogamp/opencl/CLResource.class
 [copylibs] adding entry com/jogamp/opencl/CLSampler$1.class
 [copylibs] adding entry com/jogamp/opencl/CLSampler$AddressingMode.class
 [copylibs] adding entry com/jogamp/opencl/CLSampler$CLSamplerInfoAccessor.class
 [copylibs] adding entry com/jogamp/opencl/CLSampler$FilteringMode.class
 [copylibs] adding entry com/jogamp/opencl/CLSampler.class
 [copylibs] adding entry com/jogamp/opencl/CLSubBuffer.class
 [copylibs] adding entry com/jogamp/opencl/CLUserEvent.class
 [copylibs] adding entry com/jogamp/opencl/CLVersion.class
 [copylibs] adding entry com/jogamp/opencl/InternalBufferUtil.class
 [copylibs] adding entry com/jogamp/opencl/gl/CLGLBuffer.class
 [copylibs] adding entry com/jogamp/opencl/gl/CLGLContext.class
 [copylibs] adding entry com/jogamp/opencl/gl/CLGLImage2d.class
 [copylibs] adding entry com/jogamp/opencl/gl/CLGLObject.class
 [copylibs] adding entry com/jogamp/opencl/gl/CLGLTexture.class
 [copylibs] adding entry com/jogamp/opencl/gl/CLGLTexture2d.class
 [copylibs] adding entry com/jogamp/opencl/gl/CLGLTexture3d.class
 [copylibs] adding entry com/jogamp/opencl/impl/CLTLAccessorFactory$1.class
 [copylibs] adding entry com/jogamp/opencl/impl/CLTLAccessorFactory$CLDeviceInfoAccessor.class
 [copylibs] adding entry com/jogamp/opencl/impl/CLTLAccessorFactory$CLTLPlatformInfoAccessor.class
 [copylibs] adding entry com/jogamp/opencl/impl/CLTLAccessorFactory.class
 [copylibs] adding entry com/jogamp/opencl/impl/CLTLInfoAccessor$1.class
 [copylibs] adding entry com/jogamp/opencl/impl/CLTLInfoAccessor$2.class
 [copylibs] adding entry com/jogamp/opencl/impl/CLTLInfoAccessor.class
 [copylibs] adding entry com/jogamp/opencl/llb/CL.class
 [copylibs] adding entry com/jogamp/opencl/llb/CLBufferBinding.class
 [copylibs] adding entry com/jogamp/opencl/llb/CLCommandQueueBinding.class
 [copylibs] adding entry com/jogamp/opencl/llb/CLContextBinding.class
 [copylibs] adding entry com/jogamp/opencl/llb/CLDeviceBinding.class
 [copylibs] adding entry com/jogamp/opencl/llb/CLEventBinding.class
 [copylibs] adding entry com/jogamp/opencl/llb/CLImageBinding.class
 [copylibs] adding entry com/jogamp/opencl/llb/CLKernelBinding.class
 [copylibs] adding entry com/jogamp/opencl/llb/CLMemObjBinding.class
 [copylibs] adding entry com/jogamp/opencl/llb/CLPlatformBinding.class
 [copylibs] adding entry com/jogamp/opencl/llb/CLProgramBinding.class
 [copylibs] adding entry com/jogamp/opencl/llb/CLSamplerBinding.class
 [copylibs] adding entry com/jogamp/opencl/llb/gl/CLGL.class
 [copylibs] adding entry com/jogamp/opencl/llb/impl/BuildProgramCallback.class
 [copylibs] adding entry com/jogamp/opencl/llb/impl/CLAbstractImpl$1.class
 [copylibs] adding entry com/jogamp/opencl/llb/impl/CLAbstractImpl.class
 [copylibs] adding entry com/jogamp/opencl/llb/impl/CLDynamicLibraryBundleInfo$1.class
 [copylibs] adding entry com/jogamp/opencl/llb/impl/CLDynamicLibraryBundleInfo.class
 [copylibs] adding entry com/jogamp/opencl/llb/impl/CLEventCallback.class
 [copylibs] adding entry com/jogamp/opencl/llb/impl/CLImageFormatImpl.class
 [copylibs] adding entry com/jogamp/opencl/llb/impl/CLImpl.class
 [copylibs] adding entry com/jogamp/opencl/llb/impl/CLMemObjectDestructorCallback.class
 [copylibs] adding entry com/jogamp/opencl/llb/impl/CLProcAddressTable.class
 [copylibs] adding entry com/jogamp/opencl/spi/CLAccessorFactory.class
 [copylibs] adding entry com/jogamp/opencl/spi/CLInfoAccessor.class
 [copylibs] adding entry com/jogamp/opencl/spi/CLPlatformInfoAccessor.class
 [copylibs] adding entry com/jogamp/opencl/util/CLBuildConfiguration.class
 [copylibs] adding entry com/jogamp/opencl/util/CLBuildListener.class
 [copylibs] adding entry com/jogamp/opencl/util/CLDeviceFilters$1.class
 [copylibs] adding entry com/jogamp/opencl/util/CLDeviceFilters$2.class
 [copylibs] adding entry com/jogamp/opencl/util/CLDeviceFilters$3.class
 [copylibs] adding entry com/jogamp/opencl/util/CLDeviceFilters$4.class
 [copylibs] adding entry com/jogamp/opencl/util/CLDeviceFilters$5.class
 [copylibs] adding entry com/jogamp/opencl/util/CLDeviceFilters.class
 [copylibs] adding entry com/jogamp/opencl/util/CLInfo.class
 [copylibs] adding entry com/jogamp/opencl/util/CLMultiContext.class
 [copylibs] adding entry com/jogamp/opencl/util/CLPlatformFilters$1.class
 [copylibs] adding entry com/jogamp/opencl/util/CLPlatformFilters$2.class
 [copylibs] adding entry com/jogamp/opencl/util/CLPlatformFilters$3.class
 [copylibs] adding entry com/jogamp/opencl/util/CLPlatformFilters$4.class
 [copylibs] adding entry com/jogamp/opencl/util/CLPlatformFilters$5.class
 [copylibs] adding entry com/jogamp/opencl/util/CLPlatformFilters$6.class
 [copylibs] adding entry com/jogamp/opencl/util/CLPlatformFilters.class
 [copylibs] adding entry com/jogamp/opencl/util/CLProgramConfiguration.class
 [copylibs] adding entry com/jogamp/opencl/util/CLUtil.class
 [copylibs] adding entry com/jogamp/opencl/util/Filter.class
 [copylibs] adding entry com/jogamp/opencl/util/JOCLVersion$1.class
 [copylibs] adding entry com/jogamp/opencl/util/JOCLVersion$2.class
 [copylibs] adding entry com/jogamp/opencl/util/JOCLVersion.class
 [copylibs] adding entry com/jogamp/opencl/util/MultiQueueBarrier.class
 [copylibs] adding entry com/jogamp/opencl/util/concurrent/CLCommandQueuePool$1.class
 [copylibs] adding entry com/jogamp/opencl/util/concurrent/CLCommandQueuePool$FinishAction.class
 [copylibs] adding entry com/jogamp/opencl/util/concurrent/CLCommandQueuePool$QueueThread.class
 [copylibs] adding entry com/jogamp/opencl/util/concurrent/CLCommandQueuePool$QueueThreadFactory.class
 [copylibs] adding entry com/jogamp/opencl/util/concurrent/CLCommandQueuePool$TaskWrapper.class
 [copylibs] adding entry com/jogamp/opencl/util/concurrent/CLCommandQueuePool.class
 [copylibs] adding entry com/jogamp/opencl/util/concurrent/CLQueueContext$CLSimpleQueueContext.class
 [copylibs] adding entry com/jogamp/opencl/util/concurrent/CLQueueContext.class
 [copylibs] adding entry com/jogamp/opencl/util/concurrent/CLQueueContextFactory$CLSimpleContextFactory.class
 [copylibs] adding entry com/jogamp/opencl/util/concurrent/CLQueueContextFactory.class
 [copylibs] adding entry com/jogamp/opencl/util/concurrent/CLTask.class
 [copylibs] No Implementation-Title set.No Implementation-Version set.No Implementation-Vendor set.
 [copylibs] Location: c:\JogAmpSlavex32\workspace\jocl\label\win7-x86_32-amd\nbproject\build-impl.xml:516: 
 [copylibs] Not copying the libraries.
     [echo] To run this application from the command line without Ant, try:
     [echo] java -jar "c:\JogAmpSlavex32\workspace\jocl\label\win7-x86_32-amd\build\jar\jocl.jar"

-do-jar-with-libraries-without-mainclass:
Skipped because property 'main.class.available' set.

-do-jar-with-libraries-without-manifest:
Skipped because property 'manifest.available' set.

jar.natives:
      [jar] Building jar: c:\JogAmpSlavex32\workspace\jocl\label\win7-x86_32-amd\build\jar\jocl-natives-windows-i586.jar
      [jar] Manifest warning: "Name" attributes should not occur in the main section and must be the first element in all other sections: "Name: com/jogamp/opencl/llb/impl/"
      [jar] adding directory META-INF/
      [jar] adding entry META-INF/MANIFEST.MF
      [jar] adding entry jocl.dll
      [jar] No Implementation-Title set.No Implementation-Version set.No Implementation-Vendor set.
      [jar] Location: c:\JogAmpSlavex32\workspace\jocl\label\win7-x86_32-amd\build.xml:354: 

android.package:
Skipped because property 'isAndroid' not set.

tag.build:
     [copy] Copying 1 file to c:\JogAmpSlavex32\workspace\jocl\label\win7-x86_32-amd\build
     [copy] Copying c:\JogAmpSlavex32\workspace\jogl\label\win7-x86_32-amd\build\artifact.properties to c:\JogAmpSlavex32\workspace\jocl\label\win7-x86_32-amd\build\artifact.properties

create-all-jnlps:
     [copy] Copying 1 file to c:\JogAmpSlavex32\workspace\jocl\label\win7-x86_32-amd\build
     [copy] Copying c:\JogAmpSlavex32\workspace\jocl\label\win7-x86_32-amd\jnlp-files\jocl.jnlp to c:\JogAmpSlavex32\workspace\jocl\label\win7-x86_32-amd\build\jocl.jnlp

build-archive:
Skipped because property 'build.archiveon' not set.

-post-jar:

jar:

-pre-pre-compile-test:
    [mkdir] Created dir: c:\JogAmpSlavex32\workspace\jocl\label\win7-x86_32-amd\build\test\classes

-pre-compile-test:

-compile-test-depend:
Skipped because property 'do.depend.true' not set.

-do-compile-test:
Override ignored for property "empty.dir"
    [mkdir] Skipping c:\JogAmpSlavex32\workspace\jocl\label\win7-x86_32-amd\build\empty because it already exists.
    [javac] com\jogamp\opencl\CLBufferTest.java added as com\jogamp\opencl\CLBufferTest.class doesn't exist.
    [javac] com\jogamp\opencl\CLCommandQueueTest.java added as com\jogamp\opencl\CLCommandQueueTest.class doesn't exist.
    [javac] com\jogamp\opencl\CLExceptionTest.java added as com\jogamp\opencl\CLExceptionTest.class doesn't exist.
    [javac] com\jogamp\opencl\CLImageTest.java added as com\jogamp\opencl\CLImageTest.class doesn't exist.
    [javac] com\jogamp\opencl\CLProgramTest.java added as com\jogamp\opencl\CLProgramTest.class doesn't exist.
    [javac] com\jogamp\opencl\HighLevelBindingTest.java added as com\jogamp\opencl\HighLevelBindingTest.class doesn't exist.
    [javac] com\jogamp\opencl\LowLevelBindingTest.java added as com\jogamp\opencl\LowLevelBindingTest.class doesn't exist.
    [javac] com\jogamp\opencl\TestUtils.java added as com\jogamp\opencl\TestUtils.class doesn't exist.
    [javac] com\jogamp\opencl\gl\CLGLTest.java added as com\jogamp\opencl\gl\CLGLTest.class doesn't exist.
    [javac] c:\JogAmpSlavex32\workspace\jocl\label\win7-x86_32-amd\test\com\jogamp\opencl\jogamp.png skipped - don't know how to handle it
    [javac] c:\JogAmpSlavex32\workspace\jocl\label\win7-x86_32-amd\test\com\jogamp\opencl\testkernels.cl skipped - don't know how to handle it
    [javac] com\jogamp\opencl\util\concurrent\CLMultiContextTest.java added as com\jogamp\opencl\util\concurrent\CLMultiContextTest.class doesn't exist.
    [javac] Compiling 10 source files to c:\JogAmpSlavex32\workspace\jocl\label\win7-x86_32-amd\build\test\classes
    [javac] Using modern compiler
    [javac] Compilation arguments:
    [javac] '-deprecation'
    [javac] '-d'
    [javac] 'c:\JogAmpSlavex32\workspace\jocl\label\win7-x86_32-amd\build\test\classes'
    [javac] '-classpath'
    [javac] 'c:\JogAmpSlavex32\workspace\jocl\label\win7-x86_32-amd\build\test\classes;c:\JogAmpSlavex32\workspace\gluegen\label\win7-x86_32-amd\build\gluegen-rt.jar;c:\JogAmpSlavex32\workspace\jogl\label\win7-x86_32-amd\build\jar\jogl-all.jar;c:\JogAmpSlavex32\workspace\jocl\label\win7-x86_32-amd\build\classes;c:\JogAmpSlavex32\workspace\jocl\label\win7-x86_32-amd\lib\junit_4\junit-4.8.1.jar'
    [javac] '-sourcepath'
    [javac] 'c:\JogAmpSlavex32\workspace\jocl\label\win7-x86_32-amd\build\empty'
    [javac] '-target'
    [javac] '1.6'
    [javac] '-encoding'
    [javac] 'UTF-8'
    [javac] '-g'
    [javac] '-bootclasspath'
    [javac] 'C:\jre1.6.0_30\lib\rt.jar'
    [javac] '-Xlint'
    [javac] '-g:source,lines'
    [javac] '-source'
    [javac] '1.6'
    [javac] 
    [javac] The ' characters around the executable and arguments are
    [javac] not part of the command.
    [javac] Files to be compiled:
    [javac]     c:\JogAmpSlavex32\workspace\jocl\label\win7-x86_32-amd\test\com\jogamp\opencl\CLBufferTest.java
    [javac]     c:\JogAmpSlavex32\workspace\jocl\label\win7-x86_32-amd\test\com\jogamp\opencl\CLCommandQueueTest.java
    [javac]     c:\JogAmpSlavex32\workspace\jocl\label\win7-x86_32-amd\test\com\jogamp\opencl\CLExceptionTest.java
    [javac]     c:\JogAmpSlavex32\workspace\jocl\label\win7-x86_32-amd\test\com\jogamp\opencl\CLImageTest.java
    [javac]     c:\JogAmpSlavex32\workspace\jocl\label\win7-x86_32-amd\test\com\jogamp\opencl\CLProgramTest.java
    [javac]     c:\JogAmpSlavex32\workspace\jocl\label\win7-x86_32-amd\test\com\jogamp\opencl\HighLevelBindingTest.java
    [javac]     c:\JogAmpSlavex32\workspace\jocl\label\win7-x86_32-amd\test\com\jogamp\opencl\LowLevelBindingTest.java
    [javac]     c:\JogAmpSlavex32\workspace\jocl\label\win7-x86_32-amd\test\com\jogamp\opencl\TestUtils.java
    [javac]     c:\JogAmpSlavex32\workspace\jocl\label\win7-x86_32-amd\test\com\jogamp\opencl\gl\CLGLTest.java
    [javac]     c:\JogAmpSlavex32\workspace\jocl\label\win7-x86_32-amd\test\com\jogamp\opencl\util\concurrent\CLMultiContextTest.java
    [javac] c:\JogAmpSlavex32\workspace\jocl\label\win7-x86_32-amd\test\com\jogamp\opencl\CLBufferTest.java:249: warning: [unchecked] unchecked generic array creation for varargs parameter of type Filter<CLPlatform>[]
    [javac]         CLPlatform platform = CLPlatform.getDefault(version(CL_1_1));
    [javac]                                                    ^
    [javac] c:\JogAmpSlavex32\workspace\jocl\label\win7-x86_32-amd\test\com\jogamp\opencl\CLBufferTest.java:312: warning: [unchecked] unchecked generic array creation for varargs parameter of type Filter<CLPlatform>[]
    [javac]         CLPlatform platform = CLPlatform.getDefault(version(CL_1_1));
    [javac]                                                    ^
    [javac] c:\JogAmpSlavex32\workspace\jocl\label\win7-x86_32-amd\test\com\jogamp\opencl\CLCommandQueueTest.java:170: warning: [unchecked] unchecked generic array creation for varargs parameter of type Filter<CLPlatform>[]
    [javac]         CLPlatform platform = CLPlatform.getDefault(CLPlatformFilters.queueMode(OUT_OF_ORDER_MODE));
    [javac]                                                    ^
    [javac] c:\JogAmpSlavex32\workspace\jocl\label\win7-x86_32-amd\test\com\jogamp\opencl\CLCommandQueueTest.java:177: warning: [unchecked] unchecked generic array creation for varargs parameter of type Filter<CLDevice>[]
    [javac]             device = platform.getMaxFlopsDevice(CLDeviceFilters.queueMode(OUT_OF_ORDER_MODE));
    [javac]                                                ^
    [javac] c:\JogAmpSlavex32\workspace\jocl\label\win7-x86_32-amd\test\com\jogamp\opencl\HighLevelBindingTest.java:202: warning: [unchecked] unchecked generic array creation for varargs parameter of type Filter<CLPlatform>[]
    [javac]         CLPlatform platformGPU = CLPlatform.getDefault(version(CL_1_0), type(GPU));
    [javac]                                                       ^
    [javac] c:\JogAmpSlavex32\workspace\jocl\label\win7-x86_32-amd\test\com\jogamp\opencl\HighLevelBindingTest.java:203: warning: [unchecked] unchecked generic array creation for varargs parameter of type Filter<CLPlatform>[]
    [javac]         CLPlatform platformCPU = CLPlatform.getDefault(version(CL_1_0), type(CPU));
    [javac]                                                       ^
    [javac] c:\JogAmpSlavex32\workspace\jocl\label\win7-x86_32-amd\test\com\jogamp\opencl\gl\CLGLTest.java:103: warning: [unchecked] unchecked generic array creation for varargs parameter of type Filter<CLPlatform>[]
    [javac]         CLPlatform platform = CLPlatform.getDefault(CLPlatformFilters.glSharing());
    [javac]                                                    ^
    [javac] c:\JogAmpSlavex32\workspace\jocl\label\win7-x86_32-amd\test\com\jogamp\opencl\gl\CLGLTest.java:104: warning: [unchecked] unchecked generic array creation for varargs parameter of type Filter<CLDevice>[]
    [javac]         CLDevice device = platform.getMaxFlopsDevice(CLDeviceFilters.glSharing());
    [javac]                                                     ^
    [javac] c:\JogAmpSlavex32\workspace\jocl\label\win7-x86_32-amd\test\com\jogamp\opencl\gl\CLGLTest.java:147: warning: [unchecked] unchecked generic array creation for varargs parameter of type Filter<CLPlatform>[]
    [javac]         CLPlatform platform = CLPlatform.getDefault(glSharing(glcontext));
    [javac]                                                    ^
    [javac] c:\JogAmpSlavex32\workspace\jocl\label\win7-x86_32-amd\test\com\jogamp\opencl\gl\CLGLTest.java:153: warning: [unchecked] unchecked generic array creation for varargs parameter of type Filter<CLDevice>[]
    [javac]         CLDevice theChosenOne = platform.getMaxFlopsDevice(CLDeviceFilters.glSharing());
    [javac]                                                           ^
    [javac] 10 warnings
     [copy] com\jogamp\opencl\jogamp.png added as com\jogamp\opencl\jogamp.png doesn't exist.
     [copy] com\jogamp\opencl\testkernels.cl added as com\jogamp\opencl\testkernels.cl doesn't exist.
     [copy]  omitted as c:\JogAmpSlavex32\workspace\jocl\label\win7-x86_32-amd\build\test\classes is up to date.
     [copy] com omitted as c:\JogAmpSlavex32\workspace\jocl\label\win7-x86_32-amd\build\test\classes\com is up to date.
     [copy] com\jogamp omitted as c:\JogAmpSlavex32\workspace\jocl\label\win7-x86_32-amd\build\test\classes\com\jogamp is up to date.
     [copy] com\jogamp\opencl omitted as c:\JogAmpSlavex32\workspace\jocl\label\win7-x86_32-amd\build\test\classes\com\jogamp\opencl is up to date.
     [copy] com\jogamp\opencl\gl omitted as c:\JogAmpSlavex32\workspace\jocl\label\win7-x86_32-amd\build\test\classes\com\jogamp\opencl\gl is up to date.
     [copy] com\jogamp\opencl\util omitted as c:\JogAmpSlavex32\workspace\jocl\label\win7-x86_32-amd\build\test\classes\com\jogamp\opencl\util is up to date.
     [copy] com\jogamp\opencl\util\concurrent omitted as c:\JogAmpSlavex32\workspace\jocl\label\win7-x86_32-amd\build\test\classes\com\jogamp\opencl\util\concurrent is up to date.
     [copy] Copying 2 files to c:\JogAmpSlavex32\workspace\jocl\label\win7-x86_32-amd\build\test\classes
     [copy] Copying c:\JogAmpSlavex32\workspace\jocl\label\win7-x86_32-amd\test\com\jogamp\opencl\jogamp.png to c:\JogAmpSlavex32\workspace\jocl\label\win7-x86_32-amd\build\test\classes\com\jogamp\opencl\jogamp.png
     [copy] Copying c:\JogAmpSlavex32\workspace\jocl\label\win7-x86_32-amd\test\com\jogamp\opencl\testkernels.cl to c:\JogAmpSlavex32\workspace\jocl\label\win7-x86_32-amd\build\test\classes\com\jogamp\opencl\testkernels.cl

-post-compile-test:

compile-test:

-pre-test-run:
    [mkdir] Created dir: c:\JogAmpSlavex32\workspace\jocl\label\win7-x86_32-amd\build\test\results

junit.run.if.enabled:
Project base dir set to: c:\JogAmpSlavex32\workspace\jocl\label\win7-x86_32-amd
  [antcall] calling target(s) [junit.run.tests] in build file c:\JogAmpSlavex32\workspace\jocl\label\win7-x86_32-amd\build.xml
parsing buildfile c:\JogAmpSlavex32\workspace\jocl\label\win7-x86_32-amd\build.xml with URI = file:/c:/JogAmpSlavex32/workspace/jocl/label/win7-x86_32-amd/build.xml
Project base dir set to: c:\JogAmpSlavex32\workspace\jocl\label\win7-x86_32-amd
 [property] Loading C:\Users\jogamp\jocl.properties
 [property] Unable to find property file: C:\Users\jogamp\jocl.properties
Importing file c:\JogAmpSlavex32\workspace\jocl\label\win7-x86_32-amd\nbproject\build-impl.xml from c:\JogAmpSlavex32\workspace\jocl\label\win7-x86_32-amd\build.xml
Overriding previous definition of reference to ant.projectHelper
parsing buildfile c:\JogAmpSlavex32\workspace\jocl\label\win7-x86_32-amd\nbproject\build-impl.xml with URI = file:/c:/JogAmpSlavex32/workspace/jocl/label/win7-x86_32-amd/nbproject/build-impl.xml
Already defined in main or a previous import, ignore -pre-init
Already defined in main or a previous import, ignore -init-project
Already defined in main or a previous import, ignore -post-init
Already defined in main or a previous import, ignore -pre-compile
Already defined in main or a previous import, ignore -post-compile
Already defined in main or a previous import, ignore -pre-jar
Already defined in main or a previous import, ignore -post-jar
Already defined in main or a previous import, ignore -javadoc-build
Already defined in main or a previous import, ignore -pre-test-run
Already defined in main or a previous import, ignore -do-test-run
Already defined in main or a previous import, ignore -post-test-run
Already defined in main or a previous import, ignore -post-clean
Overriding previous definition of reference to ant.projectHelper
Override ignored for property "rootrel.build"
Override ignored for property "gluegen.root"
Override ignored for property "jogl.root"
Override ignored for property "etc.build.dir"
Override ignored for property "headers.dest"
Override ignored for property "jocl.build.number"
Override ignored for property "jocl.build.branch"
Override ignored for property "jocl.build.commit"
Importing file c:\JogAmpSlavex32\workspace\gluegen\label\win7-x86_32-amd\make\gluegen-cpptasks.xml from c:\JogAmpSlavex32\workspace\jocl\label\win7-x86_32-amd\build.xml
Overriding previous definition of reference to ant.projectHelper
parsing buildfile c:\JogAmpSlavex32\workspace\gluegen\label\win7-x86_32-amd\make\gluegen-cpptasks.xml with URI = file:/c:/JogAmpSlavex32/workspace/gluegen/label/win7-x86_32-amd/make/gluegen-cpptasks.xml
Override ignored for property "gluegen.root"
Override ignored for property "gluegen.root.abs-path"
Importing file c:\JogAmpSlavex32\workspace\gluegen\label\win7-x86_32-amd\make\gluegen-properties.xml from c:\JogAmpSlavex32\workspace\gluegen\label\win7-x86_32-amd\make\gluegen-cpptasks.xml
Overriding previous definition of reference to ant.projectHelper
parsing buildfile c:\JogAmpSlavex32\workspace\gluegen\label\win7-x86_32-amd\make\gluegen-properties.xml with URI = file:/c:/JogAmpSlavex32/workspace/gluegen/label/win7-x86_32-amd/make/gluegen-properties.xml
Overriding previous definition of reference to ant.projectHelper
parsing buildfile jar:file:/c:/JogAmpSlavex32/workspace/gluegen/label/win7-x86_32-amd/make/lib/cpptasks.jar!/net/sf/antcontrib/cpptasks/antlib.xml with URI = jar:file:/c:/JogAmpSlavex32/workspace/gluegen/label/win7-x86_32-amd/make/lib/cpptasks.jar!/net/sf/antcontrib/cpptasks/antlib.xml from a zip file
Trying to override old definition of task cc
Trying to override old definition of datatype versioninfo
Trying to override old definition of datatype syslibset
Trying to override old definition of datatype distributer
Trying to override old definition of datatype compiler
Trying to override old definition of datatype defineset
Trying to override old definition of datatype targetplatform
Trying to override old definition of datatype linker
Trying to override old definition of datatype libset
 [property] Loading Environment env.
Override ignored for property "env.WINDIR"
Override ignored for property "env.HOMEDRIVE"
Override ignored for property "env.ANT_CMD_LINE_ARGS"
Override ignored for property "env.HOME"
Override ignored for property "env.FP_NO_HOST_CHECK"
Override ignored for property "env.BUILD_TAG"
Override ignored for property "env.HUDSON_URL"
Override ignored for property "env.PWD"
Override ignored for property "env.MANPATH"
Override ignored for property "env.ProgramFiles(x86)"
Override ignored for property "env.SOURCE_LEVEL"
Override ignored for property "env.SHLVL"
Override ignored for property "env.label"
Override ignored for property "env.APPDATA"
Override ignored for property "env.SYSTEMDRIVE"
Override ignored for property "env.NODE_NAME"
Override ignored for property "env.SHELL"
Override ignored for property "env.JENKINS_HOME"
Override ignored for property "env.PUBLIC"
Override ignored for property "env.COMPUTERNAME"
Override ignored for property "env.COMMONPROGRAMFILES"
Override ignored for property "env.JAVA_HOME"
Override ignored for property "env.AMDAPPSDKROOT"
Override ignored for property "env.PSModulePath"
Override ignored for property "env.OLDPWD"
Override ignored for property "env.RoxioCentral"
Override ignored for property "env.JOB_NAME"
Override ignored for property "env.ProgramW6432"
Override ignored for property "env.GIT_PREVIOUS_COMMIT"
Override ignored for property "env.JENKINS_URL"
Override ignored for property "env.GIT_BRANCH"
Override ignored for property "env.LOCALAPPDATA"
Override ignored for property "env.LOGONSERVER"
Override ignored for property "env.ATISTREAMSDKSAMPLESROOT"
Override ignored for property "env.PROCESSOR_REVISION"
Override ignored for property "env.EXECUTOR_NUMBER"
Override ignored for property "env.NODE_LABELS"
Override ignored for property "env.LANG"
Override ignored for property "env.FPPUILang"
Override ignored for property "env.JOB_URL"
Override ignored for property "env._JAVACMD"
Override ignored for property "env.ALLUSERSPROFILE"
Override ignored for property "env.USERDOMAIN"
Override ignored for property "env.HOSTNAME"
Override ignored for property "env.HOMEPATH"
Override ignored for property "env.TARGET_LEVEL"
Override ignored for property "env.GIT_COMMIT"
Override ignored for property "env.WORKSPACE"
Override ignored for property "env.PATH"
Override ignored for property "env.ANT_PATH"
Override ignored for property "env.tmp"
Override ignored for property "env.PROMPT"
Override ignored for property "env.USER"
Override ignored for property "env.HUDSON_HOME"
Override ignored for property "env.BUILD_NUMBER"
Override ignored for property "env.TZ"
Override ignored for property "env.J2RE_HOME"
Override ignored for property "env.OOBEUILang"
Override ignored for property "env.USERPROFILE"
Override ignored for property "env._USE_CLASSPATH"
Override ignored for property "env.PRINTER"
Override ignored for property "env.NUMBER_OF_PROCESSORS"
Override ignored for property "env.temp"
Override ignored for property "env.CommonProgramFiles(x86)"
Override ignored for property "env.OS"
Override ignored for property "env.PROCESSOR_ARCHITEW6432"
Override ignored for property "env.JENKINS_SERVER_COOKIE"
Override ignored for property "env.INFOPATH"
Override ignored for property "env.TARGET_RT_JAR"
Override ignored for property "env.BUILD_ID"
Override ignored for property "env.BUILD_URL"
Override ignored for property "env.CommonProgramW6432"
Override ignored for property "env.GIT_URL"
Override ignored for property "env.ANT_HOME"
Override ignored for property "env.TERM"
Override ignored for property "env.PROCESSOR_LEVEL"
Override ignored for property "env.PROCESSOR_ARCHITECTURE"
Override ignored for property "env.PROGRAMFILES"
Override ignored for property "env.JOGAMP_JAR_CODEBASE"
Override ignored for property "env.HUDSON_SERVER_COOKIE"
Override ignored for property "env.ProgramData"
Override ignored for property "env.=C:"
Override ignored for property "env.BUILD_DISPLAY_NAME"
Override ignored for property "env.GIT_PATH"
Override ignored for property "env.SEVENZIP"
Override ignored for property "env.COMSPEC"
Override ignored for property "env._"
Override ignored for property "env.PATHEXT"
Override ignored for property "env.HUDSON_COOKIE"
Override ignored for property "env.PROCESSOR_IDENTIFIER"
Override ignored for property "env.SYSTEMROOT"
Override ignored for property "env.USERNAME"
Override ignored for property "env.SESSIONNAME"
Override ignored for property "env.EMC_AUTOPLAY"
Property "env.GLUEGEN_CPPTASKS_FILE" has not been set
Property "env.GLUEGEN_CPPTASKS_FILE" has not been set
Property "gluegen-cpptasks.file" has not been set
Property "gluegen-cpptasks.file" has not been set
[available] Unable to find c:\JogAmpSlavex32\workspace\gluegen\label\win7-x86_32-amd\${gluegen-cpptasks.file}
Property "gluegen-cpptasks.file" has not been set
Property "gluegen-cpptasks.file" has not been set
[available] Unable to find ${gluegen-cpptasks.file}
Override ignored for property "gluegen-cpptasks.file.rel"
Override ignored for property "gluegen-cpptasks.file.abs-path"
Importing file c:\JogAmpSlavex32\workspace\gluegen\label\win7-x86_32-amd\make\gluegen-cpptasks-base.xml from c:\JogAmpSlavex32\workspace\gluegen\label\win7-x86_32-amd\make\gluegen-cpptasks.xml
Overriding previous definition of reference to ant.projectHelper
parsing buildfile c:\JogAmpSlavex32\workspace\gluegen\label\win7-x86_32-amd\make\gluegen-cpptasks-base.xml with URI = file:/c:/JogAmpSlavex32/workspace/gluegen/label/win7-x86_32-amd/make/gluegen-cpptasks-base.xml
 [macrodef] creating macro  msvc.manifest
Overriding previous definition of reference to ant.projectHelper
Overriding previous definition of reference to ant.projectHelper
Importing file c:\JogAmpSlavex32\workspace\gluegen\label\win7-x86_32-amd\make\jogamp-env.xml from c:\JogAmpSlavex32\workspace\jocl\label\win7-x86_32-amd\build.xml
Overriding previous definition of reference to ant.projectHelper
parsing buildfile c:\JogAmpSlavex32\workspace\gluegen\label\win7-x86_32-amd\make\jogamp-env.xml with URI = file:/c:/JogAmpSlavex32/workspace/gluegen/label/win7-x86_32-amd/make/jogamp-env.xml
Overriding previous definition of reference to ant.projectHelper
Importing file c:\JogAmpSlavex32\workspace\gluegen\label\win7-x86_32-amd\make\jogamp-archivetasks.xml from c:\JogAmpSlavex32\workspace\jocl\label\win7-x86_32-amd\build.xml
Overriding previous definition of reference to ant.projectHelper
parsing buildfile c:\JogAmpSlavex32\workspace\gluegen\label\win7-x86_32-amd\make\jogamp-archivetasks.xml with URI = file:/c:/JogAmpSlavex32/workspace/gluegen/label/win7-x86_32-amd/make/jogamp-archivetasks.xml
Override ignored for property "jogamp-archivetasks.basedir"
parsing buildfile jar:file:/c:/JogAmpSlavex32/workspace/gluegen/label/win7-x86_32-amd/make/lib/ant-contrib-1.0b3.jar!/net/sf/antcontrib/antlib.xml with URI = jar:file:/c:/JogAmpSlavex32/workspace/gluegen/label/win7-x86_32-amd/make/lib/ant-contrib-1.0b3.jar!/net/sf/antcontrib/antlib.xml from a zip file
Trying to override old definition of task propertycopy
Trying to override old definition of task shellscript
Trying to override old definition of task pathtofileset
Trying to override old definition of task runtarget
Trying to override old definition of task remoteant
Trying to override old definition of task propertyregex
Trying to override old definition of task assert
Trying to override old definition of task math
Trying to override old definition of task trycatch
Trying to override old definition of task antserver
Trying to override old definition of task antcallback
Trying to override old definition of task compilewithwalls
Trying to override old definition of task outofdate
Trying to override old definition of task osfamily
Trying to override old definition of task stopwatch
Trying to override old definition of task throw
Trying to override old definition of task antclipse
Trying to override old definition of task urlencode
Trying to override old definition of task timestampselector
Trying to override old definition of task foreach
Trying to override old definition of task if
Trying to override old definition of task propertyselector
Trying to override old definition of task sortlist
Trying to override old definition of task antfetch
Trying to override old definition of task post
Trying to override old definition of task forget
Trying to override old definition of task limit
Trying to override old definition of task switch
Trying to override old definition of task relentless
Trying to override old definition of task var
Trying to override old definition of task inifile
Trying to override old definition of task verifydesign
Trying to override old definition of task for
Trying to override old definition of datatype httpState
Trying to override old definition of datatype httpClient
Trying to override old definition of task getCookie
Trying to override old definition of task addCookie
Trying to override old definition of task clearCookies
Trying to override old definition of task addCredentials
Trying to override old definition of task clearCredentials
Trying to override old definition of task purgeExpiredCookies
Trying to override old definition of task postMethod
Trying to override old definition of task getMethod
Trying to override old definition of task headMethod
Trying to override old definition of task importurl
 [macrodef] creating macro  archive.7z
Overriding previous definition of reference to ant.projectHelper
Importing file c:\JogAmpSlavex32\workspace\gluegen\label\win7-x86_32-amd\make\jogamp-androidtasks.xml from c:\JogAmpSlavex32\workspace\jocl\label\win7-x86_32-amd\build.xml
Overriding previous definition of reference to ant.projectHelper
parsing buildfile c:\JogAmpSlavex32\workspace\gluegen\label\win7-x86_32-amd\make\jogamp-androidtasks.xml with URI = file:/c:/JogAmpSlavex32/workspace/gluegen/label/win7-x86_32-amd/make/jogamp-androidtasks.xml
Override ignored for property "jogamp-androidtasks.basedir"
parsing buildfile jar:file:/c:/JogAmpSlavex32/workspace/gluegen/label/win7-x86_32-amd/make/lib/ant-contrib-1.0b3.jar!/net/sf/antcontrib/antlib.xml with URI = jar:file:/c:/JogAmpSlavex32/workspace/gluegen/label/win7-x86_32-amd/make/lib/ant-contrib-1.0b3.jar!/net/sf/antcontrib/antlib.xml from a zip file
Trying to override old definition of task propertycopy
Trying to override old definition of task shellscript
Trying to override old definition of task pathtofileset
Trying to override old definition of task runtarget
Trying to override old definition of task remoteant
Trying to override old definition of task propertyregex
Trying to override old definition of task assert
Trying to override old definition of task math
Trying to override old definition of task trycatch
Trying to override old definition of task antserver
Trying to override old definition of task antcallback
Trying to override old definition of task compilewithwalls
Trying to override old definition of task outofdate
Trying to override old definition of task osfamily
Trying to override old definition of task stopwatch
Trying to override old definition of task throw
Trying to override old definition of task antclipse
Trying to override old definition of task urlencode
Trying to override old definition of task timestampselector
Trying to override old definition of task foreach
Trying to override old definition of task if
Trying to override old definition of task propertyselector
Trying to override old definition of task sortlist
Trying to override old definition of task antfetch
Trying to override old definition of task post
Trying to override old definition of task forget
Trying to override old definition of task limit
Trying to override old definition of task switch
Trying to override old definition of task relentless
Trying to override old definition of task var
Trying to override old definition of task inifile
Trying to override old definition of task verifydesign
Trying to override old definition of task for
Trying to override old definition of datatype httpState
Trying to override old definition of datatype httpClient
Trying to override old definition of task getCookie
Trying to override old definition of task addCookie
Trying to override old definition of task clearCookies
Trying to override old definition of task addCredentials
Trying to override old definition of task clearCredentials
Trying to override old definition of task purgeExpiredCookies
Trying to override old definition of task postMethod
Trying to override old definition of task getMethod
Trying to override old definition of task headMethod
Trying to override old definition of task importurl
Trying to override old definition of task aapt.signed
 [macrodef] creating macro  aapt.signed
Overriding previous definition of reference to ant.projectHelper
Build sequence for target(s) `junit.run.tests' is [junit.run.local, junit.run.remote.ssh, junit.run.tests]
Complete build sequence is [junit.run.local, junit.run.remote.ssh, junit.run.tests, gluegen.cpptasks.declare.compiler.solaris32, gluegen.cpptasks.declare.compiler.solaris.sparcv9, gluegen.cpptasks.declare.compiler.solaris.amd64, gluegen.cpptasks.declare.compiler.solaris, gluegen.properties.load.user, gluegen.cpptasks.initialize, JOCL-impl.-init-debug-args, jogamp.env.validation, jogamp.env.init, gluegen.cpptasks.detect.os.custom, gluegen.cpptasks.detect.os.1, gluegen.cpptasks.detect.os.refine, gluegen.cpptasks.detect.os.freebsd.amd64, gluegen.cpptasks.detect.os.freebsd.x86, gluegen.cpptasks.detect.os.freebsd, gluegen.cpptasks.detect.os.hpux, gluegen.cpptasks.detect.os.linux.amd64, gluegen.cpptasks.detect.os.linux.ia64, gluegen.cpptasks.detect.os.linux.x86, gluegen.cpptasks.detect.os.linux.armv6.armel, gluegen.cpptasks.detect.os.linux.armv6.armhf, gluegen.cpptasks.detect.os.android.armv6.armel, gluegen.cpptasks.detect.os.android.armv6.armhf, gluegen.cpptasks.detect.os.linux.alpha, gluegen.cpptasks.detect.os.linux.hppa, gluegen.cpptasks.detect.os.linux.mips, gluegen.cpptasks.detect.os.linux.mipsel, gluegen.cpptasks.detect.os.linux.ppc, gluegen.cpptasks.detect.os.linux.s390, gluegen.cpptasks.detect.os.linux.s390x, gluegen.cpptasks.detect.os.linux.sparc, gluegen.cpptasks.detect.os.linux, gluegen.cpptasks.detect.os.osx, gluegen.cpptasks.detect.os.solaris.sparc, gluegen.cpptasks.detect.os.solaris.sparcv9, gluegen.cpptasks.detect.os.solaris.amd64, gluegen.cpptasks.detect.os.solaris.x86, gluegen.cpptasks.detect.os.solaris, gluegen.cpptasks.detect.os.unix, gluegen.cpptasks.detect.os.windows.amd64, gluegen.cpptasks.detect.os.windows.x86, gluegen.cpptasks.detect.os.windows, gluegen.cpptasks.detect.os.2, gluegen.cpptasks.detect.os, -pre-init, -init-private, -pre-init-libraries, -init-private-libraries, -init-libraries, -init-user, -init-project, -init-macrodef-property, -do-init, -post-init, -init-check, -init-macrodef-javac, -init-macrodef-junit, -init-debug-args, -init-macrodef-nbjpda, -init-macrodef-debug, -init-macrodef-java, -init-presetdef-jar, init, -deps-jar-init, deps-jar, -check-automatic-build, -clean-after-automatic-build, -verify-automatic-build, -pre-pre-compile, detect-jdk, prepare-jdk5-build, prepare-jdk7-build, prepare-build, preprocess-headers, generate-binding, -pre-compile, -compile-depend, -do-compile, gluegen.cpptasks.detect.compiler, setup.java.home.dir.nonmacosx, setup.java.home.dir.macosx, setup.java.home.dir, gluegen.cpptasks.configure.compiler, gluegen.cpptasks.declare.compiler.environment, gluegen.cpptasks.declare.compiler.win32.vc6, gluegen.cpptasks.declare.compiler.win32.vc7, gluegen.cpptasks.declare.compiler.win32.vc8, gluegen.cpptasks.declare.compiler.win32.vc8_x64, gluegen.cpptasks.declare.compiler.win32.vc9, gluegen.cpptasks.declare.compiler.win32.mingw, gluegen.cpptasks.declare.compiler.win64.mingw, gluegen.cpptasks.declare.compiler.win32, gluegen.cpptasks.declare.compiler.linux.x86, gluegen.cpptasks.declare.compiler.linux.amd64, gluegen.cpptasks.declare.compiler.linux.ia64, gluegen.cpptasks.declare.compiler.linux.armv6, gluegen.cpptasks.declare.compiler.linux.alpha, gluegen.cpptasks.declare.compiler.linux.hppa, gluegen.cpptasks.declare.compiler.linux.mips, gluegen.cpptasks.declare.compiler.linux.mipsel, gluegen.cpptasks.declare.compiler.linux.ppc, gluegen.cpptasks.declare.compiler.linux.s390, gluegen.cpptasks.declare.compiler.linux.s390x, gluegen.cpptasks.declare.compiler.linux.sparc, gluegen.cpptasks.declare.compiler.linux, gluegen.cpptasks.declare.compiler.macosx, gluegen.cpptasks.declare.compiler.freebsd.x86, gluegen.cpptasks.declare.compiler.freebsd.amd64, gluegen.cpptasks.declare.compiler.freebsd, gluegen.cpptasks.declare.compiler.hpux, gluegen.cpptasks.declare.compiler, c.configure.win.mingw32, c.configure.win.mingw64, c.configure.win, c.configure.linux.x86, c.configure.linux.amd64, c.configure.linux.armv6, c.configure.linux, c.configure.macosx, c.configure.solaris.x86, c.configure.solaris.sparc, c.configure.solaris.sparcv9, c.configure.solaris.amd64, c.configure.solaris, c.configure.os, c.configure.default, jocl.configure.compiler, jocl.configure.linker, mac.includepath.hack, c.setup.build, jocl.c.compile, c.rename.lib.mingw, c.compile.default, -post-compile, compile, -pre-pre-compile-test, -pre-compile-test, -compile-test-depend, -do-compile-test, -post-compile-test, compile-test, -pre-test-run, junit.run.if.enabled, junit.run.if.disabled, -do-test-run, test-report, -post-test-run, -test-browse, JOCL-impl.test, -pre-compile-single, -do-compile-single, -post-compile-single, compile-single, run-single, build-javadoc, archive-javadoc, -javadoc-build, GlueGen-cpptasks-base.gluegen.cpptasks.striplibs, JOCL-impl.-init-macrodef-javac, GlueGen-cpptasks-base.gluegen.cpptasks.declare.compiler.solaris, GlueGen-cpptasks-base.gluegen.cpptasks.declare.compiler.hpux, JOCL-impl.-post-compile-test, GlueGen-cpptasks-base.gluegen.cpptasks.declare.compiler.win64.mingw, -debug-start-debugger, -debug-start-debuggee-single, JOCL-impl.debug-single, -pre-test-run-single, -check-call-dep, -pre-compile-test-single, -do-compile-test-single, -post-compile-test-single, compile-test-single, JOCL-impl.-debug-start-debuggee-main-test, test, -pre-jar, -pre-pre-jar, -do-jar-with-manifest, -do-jar-without-manifest, -do-jar-with-mainclass, -do-jar-with-libraries, -do-jar-with-libraries-without-mainclass, -do-jar-with-libraries-without-manifest, jar.natives, android.package, tag.build, create-all-jnlps, build-archive, -post-jar, jar, -javadoc-browse, javadoc, default, -debug-start-debuggee-applet, GlueGen-cpptasks-base.gluegen.cpptasks.detect.os.freebsd.amd64, -debug-start-debuggee-main-test, JOCL-impl.-do-jar-with-libraries-without-mainclass, GlueGen-cpptasks-base.gluegen.cpptasks.detect.os.linux.armv6.armhf, JOCL-impl.-pre-debug-fix, JOCL-impl.-init-macrodef-nbjpda, JOCL-impl.-init-private, GlueGen-cpptasks-base.gluegen.cpptasks.detect.os.solaris.x86, jogamp-env.jogamp.env.validation, GlueGen-cpptasks-base.gluegen.cpptasks.detect.os.osx, GlueGen-cpptasks-base.gluegen.cpptasks.declare.compiler.linux.armv6, JOCL-impl.run, JOCL-impl.-post-jar, -warn-already-built-jar, JOCL-impl.debug-applet, -debug-start-debuggee, JOCL-impl.debug, -deps-clean-init, JOCL-impl.deps-clean, JOCL-impl.-check-call-dep, GlueGen-cpptasks-base.gluegen.cpptasks.detect.os.freebsd, update-headers, -warn-already-built-clean, GlueGen-cpptasks-base.gluegen.cpptasks.detect.os.custom, GlueGen-cpptasks-base.gluegen.cpptasks.detect.os.linux.ppc, -do-not-recompile, GlueGen-cpptasks-base.gluegen.cpptasks.declare.compiler.linux.ia64, -debug-start-debugger-test, -debug-start-debuggee-test, debug-test, GlueGen-cpptasks-base.gluegen.cpptasks.detect.os.solaris.sparc, GlueGen-cpptasks-base.gluegen.cpptasks.declare.compiler.linux.amd64, GlueGen-cpptasks-base.gluegen.cpptasks.declare.compiler.freebsd.amd64, JOCL-impl.-post-init, -debug-start-debugger-stepinto, JOCL-impl.debug-stepinto, JOCL-impl.-debug-start-debuggee-test, GlueGen-cpptasks-base.gluegen.cpptasks.detect.os.refine, GlueGen-cpptasks-base.gluegen.cpptasks.declare.compiler.win32.vc8_x64, GlueGen-cpptasks-base.gluegen.cpptasks.detect.os.linux.armv6.armel, GlueGen-cpptasks-base.setup.java.home.dir.macosx, GlueGen-cpptasks-base.gluegen.cpptasks.declare.compiler.macosx, jar-test, JOCL-impl.-do-jar-with-mainclass, JOCL-impl.-init-user, debug-applet, -do-test-run-single, -post-test-run-single, JOCL-impl.test-single, JOCL-impl.-do-not-recompile, jogamp-env.jogamp.env.init, GlueGen-cpptasks-base.gluegen.cpptasks.initialize, JOCL-impl.-compile-test-depend, JOCL-impl.-do-jar-with-manifest, GlueGen-cpptasks-base.gluegen.cpptasks.detect.os.solaris.sparcv9, -pre-debug-fix, JOCL-impl.-do-debug-fix, GlueGen-cpptasks-base.gluegen.cpptasks.setup.compiler, GlueGen-cpptasks-base.gluegen.cpptasks.declare.compiler.linux.s390, run, GlueGen-cpptasks-base.gluegen.cpptasks.declare.compiler.linux.ppc, -do-debug-fix-test, JOCL-impl.-init-presetdef-jar, JOCL-impl.-post-clean, GlueGen-cpptasks-base.gluegen.cpptasks.detect.os.linux.ia64, JOCL-impl.-debug-start-debugger, JOCL-impl.-init-macrodef-debug, GlueGen-cpptasks-base.gluegen.cpptasks.declare.compiler.environment, JOCL-impl.-debug-start-debuggee, JOCL-impl.debug-fix-test, GlueGen-cpptasks-base.gluegen.cpptasks.detect.os.solaris, GlueGen-cpptasks-base.gluegen.cpptasks.detect.os.linux.sparc, GlueGen-cpptasks-base.setup.java.home.dir, GlueGen-cpptasks-base.gluegen.cpptasks.declare.compiler.solaris32, GlueGen-cpptasks-base.gluegen.cpptasks.declare.compiler.win32, GlueGen-cpptasks-base.gluegen.cpptasks.declare.compiler.linux, JOCL-impl.-pre-pre-compile-test, JOCL-impl.-debug-start-debugger-test, GlueGen-cpptasks-base.gluegen.cpptasks.declare.compiler.linux.mips, deps-clean, -do-clean, -post-clean, JOCL-impl.clean, -debug-start-debugger-main-test, JOCL-impl.debug-test-with-main, JOCL-impl.init, GlueGen-cpptasks-base.gluegen.cpptasks.detect.os.linux.s390x, JOCL-impl.-test-browse, run-applet, GlueGen-cpptasks-base.gluegen.cpptasks.detect.os.windows, JOCL-impl.-do-jar-with-libraries, GlueGen-cpptasks-base.setup.java.home.dir.nonmacosx, GlueGen-cpptasks-base.gluegen.cpptasks.detect.os.linux.s390, JOCL-impl.-debug-start-debugger-main-test, GlueGen-cpptasks-base.gluegen.cpptasks.detect.os.android.armv6.armhf, JOCL-impl.-do-init, JOCL-impl.-pre-pre-compile, JOCL-impl.-do-compile-test-single, JOCL-impl.-init-project, JOCL-impl.-debug-start-debuggee-single, JOCL-impl.compile, run-test-with-main, GlueGen-cpptasks-base.gluegen.cpptasks.detect.os.linux.x86, -maybe-call-dep, JOCL-impl.-javadoc-build, JOCL-impl.-do-jar-with-libraries-without-manifest, JOCL-impl.-init-check, clean-jar-test, JOCL-impl.debug-test, JOCL-impl.compile-single, debug, GlueGen-cpptasks-base.gluegen.cpptasks.detect.os.linux.mips, JOCL-impl.-pre-compile-test, JOCL-impl.-deps-clean-init, JOCL-impl.default, JOCL-impl.-init-private-libraries, JOCL-impl.-debug-start-debugger-stepinto, gluegen.cpptasks.striplibs, GlueGen-cpptasks-base.gluegen.cpptasks.declare.compiler.win32.vc9, GlueGen-cpptasks-base.gluegen.cpptasks.declare.compiler.win32.vc8, JOCL-impl.-init-macrodef-property, GlueGen-cpptasks-base.gluegen.cpptasks.declare.compiler.win32.vc7, GlueGen-cpptasks-base.gluegen.cpptasks.declare.compiler.win32.vc6, GlueGen-properties.gluegen.properties.load.user, GlueGen-cpptasks-base.gluegen.cpptasks.detect.os.android.armv6.armel, debug-test-with-main, GlueGen-cpptasks-base.gluegen.cpptasks.detect.os.hpux, JOCL-impl.compile-test, GlueGen-cpptasks-base.gluegen.cpptasks.declare.compiler, GlueGen-cpptasks-base.gluegen.cpptasks.detect.os.windows.x86, GlueGen-cpptasks-base.gluegen.cpptasks.detect.os.linux.alpha, JOCL-impl.-check-automatic-build, gluegen.cpptasks.setup.compiler, JOCL-impl.-post-compile, JOCL-impl.-do-compile, -do-debug-fix, JOCL-impl.-pre-jar, GlueGen-cpptasks-base.gluegen.cpptasks.declare.compiler.linux.mipsel, JOCL-impl.-pre-test-run-single, GlueGen-cpptasks-base.gluegen.cpptasks.detect.compiler, GlueGen-cpptasks-base.gluegen.cpptasks.declare.compiler.linux.x86, GlueGen-cpptasks-base.gluegen.cpptasks.detect.os.unix, JOCL-impl.compile-test-single, JOCL-impl.-warn-already-built-clean, JOCL-impl.-pre-compile-test-single, GlueGen-cpptasks-base.gluegen.cpptasks.declare.compiler.solaris.sparcv9, JOCL-impl.-pre-init, GlueGen-cpptasks-base.gluegen.cpptasks.detect.os.freebsd.x86, JOCL-impl.-deps-jar-init, JOCL-impl.-init-libraries, JOCL-impl.run-single, JOCL-impl.-do-debug-fix-test, JOCL-impl.javadoc, JOCL-impl.-pre-test-run, GlueGen-cpptasks-base.gluegen.cpptasks.detect.os.solaris.amd64, debug-fix, JOCL-impl.debug-fix, JOCL-impl.-warn-already-built-jar, JOCL-impl.test-report, GlueGen-cpptasks-base.gluegen.cpptasks.declare.compiler.linux.sparc, JOCL-impl.-verify-automatic-build, JOCL-impl.-pre-compile, clean, JOCL-impl.run-applet, debug-stepinto, JOCL-impl.deps-jar, JOCL-impl.-post-compile-test-single, JOCL-impl.-do-compile-test, GlueGen-cpptasks-base.gluegen.cpptasks.declare.compiler.linux.s390x, GlueGen-cpptasks-base.gluegen.cpptasks.declare.compiler.win32.mingw, JOCL-impl.-clean-after-automatic-build, GlueGen-cpptasks-base.gluegen.cpptasks.detect.os.linux, JOCL-impl.run-test-with-main, JOCL-impl.-do-compile-single, GlueGen-cpptasks-base.gluegen.cpptasks.declare.compiler.solaris.amd64, JOCL-impl.-do-clean, JOCL-impl.-do-test-run-single, GlueGen-cpptasks-base.gluegen.cpptasks.declare.compiler.linux.hppa, JOCL-impl.-compile-depend, GlueGen-cpptasks-base.gluegen.cpptasks.detect.os.linux.amd64, JOCL-impl.-debug-start-debuggee-applet, GlueGen-cpptasks-base.gluegen.cpptasks.declare.compiler.freebsd, debug-single, GlueGen-cpptasks-base.gluegen.cpptasks.detect.os.2, JOCL-impl.-init-macrodef-java, GlueGen-cpptasks-base.gluegen.cpptasks.detect.os.1, JOCL-impl.-maybe-call-dep, JOCL-impl.-pre-init-libraries, JOCL-impl.-post-compile-single, debug-fix-test, JOCL-impl.-init-macrodef-junit, GlueGen-cpptasks-base.gluegen.cpptasks.detect.os.linux.mipsel, GlueGen-cpptasks-base.gluegen.cpptasks.detect.os, JOCL-impl.-pre-pre-jar, JOCL-impl.-pre-compile-single, GlueGen-cpptasks-base.gluegen.cpptasks.detect.os.windows.amd64, test-single, test-file, GlueGen-cpptasks-base.gluegen.cpptasks.declare.compiler.linux.alpha, JOCL-impl.-post-test-run-single, JOCL-impl.-do-test-run, JOCL-impl.jar, GlueGen-cpptasks-base.gluegen.cpptasks.detect.os.linux.hppa, JOCL-impl.-javadoc-browse, JOCL-impl.-do-jar-without-manifest, JOCL-impl.-post-test-run, GlueGen-cpptasks-base.gluegen.cpptasks.configure.compiler, GlueGen-cpptasks-base.gluegen.cpptasks.declare.compiler.freebsd.x86, ]
  [antcall] Entering c:\JogAmpSlavex32\workspace\jocl\label\win7-x86_32-amd\build.xml...
Build sequence for target(s) `junit.run.tests' is [junit.run.local, junit.run.remote.ssh, junit.run.tests]
Complete build sequence is [junit.run.local, junit.run.remote.ssh, junit.run.tests, gluegen.cpptasks.declare.compiler.solaris32, gluegen.cpptasks.declare.compiler.solaris.sparcv9, gluegen.cpptasks.declare.compiler.solaris.amd64, gluegen.cpptasks.declare.compiler.solaris, gluegen.properties.load.user, gluegen.cpptasks.initialize, JOCL-impl.-init-debug-args, jogamp.env.validation, jogamp.env.init, gluegen.cpptasks.detect.os.custom, gluegen.cpptasks.detect.os.1, gluegen.cpptasks.detect.os.refine, gluegen.cpptasks.detect.os.freebsd.amd64, gluegen.cpptasks.detect.os.freebsd.x86, gluegen.cpptasks.detect.os.freebsd, gluegen.cpptasks.detect.os.hpux, gluegen.cpptasks.detect.os.linux.amd64, gluegen.cpptasks.detect.os.linux.ia64, gluegen.cpptasks.detect.os.linux.x86, gluegen.cpptasks.detect.os.linux.armv6.armel, gluegen.cpptasks.detect.os.linux.armv6.armhf, gluegen.cpptasks.detect.os.android.armv6.armel, gluegen.cpptasks.detect.os.android.armv6.armhf, gluegen.cpptasks.detect.os.linux.alpha, gluegen.cpptasks.detect.os.linux.hppa, gluegen.cpptasks.detect.os.linux.mips, gluegen.cpptasks.detect.os.linux.mipsel, gluegen.cpptasks.detect.os.linux.ppc, gluegen.cpptasks.detect.os.linux.s390, gluegen.cpptasks.detect.os.linux.s390x, gluegen.cpptasks.detect.os.linux.sparc, gluegen.cpptasks.detect.os.linux, gluegen.cpptasks.detect.os.osx, gluegen.cpptasks.detect.os.solaris.sparc, gluegen.cpptasks.detect.os.solaris.sparcv9, gluegen.cpptasks.detect.os.solaris.amd64, gluegen.cpptasks.detect.os.solaris.x86, gluegen.cpptasks.detect.os.solaris, gluegen.cpptasks.detect.os.unix, gluegen.cpptasks.detect.os.windows.amd64, gluegen.cpptasks.detect.os.windows.x86, gluegen.cpptasks.detect.os.windows, gluegen.cpptasks.detect.os.2, gluegen.cpptasks.detect.os, -pre-init, -init-private, -pre-init-libraries, -init-private-libraries, -init-libraries, -init-user, -init-project, -init-macrodef-property, -do-init, -post-init, -init-check, -init-macrodef-javac, -init-macrodef-junit, -init-debug-args, -init-macrodef-nbjpda, -init-macrodef-debug, -init-macrodef-java, -init-presetdef-jar, init, -deps-jar-init, deps-jar, -check-automatic-build, -clean-after-automatic-build, -verify-automatic-build, -pre-pre-compile, detect-jdk, prepare-jdk5-build, prepare-jdk7-build, prepare-build, preprocess-headers, generate-binding, -pre-compile, -compile-depend, -do-compile, gluegen.cpptasks.detect.compiler, setup.java.home.dir.nonmacosx, setup.java.home.dir.macosx, setup.java.home.dir, gluegen.cpptasks.configure.compiler, gluegen.cpptasks.declare.compiler.environment, gluegen.cpptasks.declare.compiler.win32.vc6, gluegen.cpptasks.declare.compiler.win32.vc7, gluegen.cpptasks.declare.compiler.win32.vc8, gluegen.cpptasks.declare.compiler.win32.vc8_x64, gluegen.cpptasks.declare.compiler.win32.vc9, gluegen.cpptasks.declare.compiler.win32.mingw, gluegen.cpptasks.declare.compiler.win64.mingw, gluegen.cpptasks.declare.compiler.win32, gluegen.cpptasks.declare.compiler.linux.x86, gluegen.cpptasks.declare.compiler.linux.amd64, gluegen.cpptasks.declare.compiler.linux.ia64, gluegen.cpptasks.declare.compiler.linux.armv6, gluegen.cpptasks.declare.compiler.linux.alpha, gluegen.cpptasks.declare.compiler.linux.hppa, gluegen.cpptasks.declare.compiler.linux.mips, gluegen.cpptasks.declare.compiler.linux.mipsel, gluegen.cpptasks.declare.compiler.linux.ppc, gluegen.cpptasks.declare.compiler.linux.s390, gluegen.cpptasks.declare.compiler.linux.s390x, gluegen.cpptasks.declare.compiler.linux.sparc, gluegen.cpptasks.declare.compiler.linux, gluegen.cpptasks.declare.compiler.macosx, gluegen.cpptasks.declare.compiler.freebsd.x86, gluegen.cpptasks.declare.compiler.freebsd.amd64, gluegen.cpptasks.declare.compiler.freebsd, gluegen.cpptasks.declare.compiler.hpux, gluegen.cpptasks.declare.compiler, c.configure.win.mingw32, c.configure.win.mingw64, c.configure.win, c.configure.linux.x86, c.configure.linux.amd64, c.configure.linux.armv6, c.configure.linux, c.configure.macosx, c.configure.solaris.x86, c.configure.solaris.sparc, c.configure.solaris.sparcv9, c.configure.solaris.amd64, c.configure.solaris, c.configure.os, c.configure.default, jocl.configure.compiler, jocl.configure.linker, mac.includepath.hack, c.setup.build, jocl.c.compile, c.rename.lib.mingw, c.compile.default, -post-compile, compile, -pre-pre-compile-test, -pre-compile-test, -compile-test-depend, -do-compile-test, -post-compile-test, compile-test, -pre-test-run, junit.run.if.enabled, junit.run.if.disabled, -do-test-run, test-report, -post-test-run, -test-browse, JOCL-impl.test, -pre-compile-single, -do-compile-single, -post-compile-single, compile-single, run-single, build-javadoc, archive-javadoc, -javadoc-build, GlueGen-cpptasks-base.gluegen.cpptasks.striplibs, JOCL-impl.-init-macrodef-javac, GlueGen-cpptasks-base.gluegen.cpptasks.declare.compiler.solaris, GlueGen-cpptasks-base.gluegen.cpptasks.declare.compiler.hpux, JOCL-impl.-post-compile-test, GlueGen-cpptasks-base.gluegen.cpptasks.declare.compiler.win64.mingw, -debug-start-debugger, -debug-start-debuggee-single, JOCL-impl.debug-single, -pre-test-run-single, -check-call-dep, -pre-compile-test-single, -do-compile-test-single, -post-compile-test-single, compile-test-single, JOCL-impl.-debug-start-debuggee-main-test, test, -pre-jar, -pre-pre-jar, -do-jar-with-manifest, -do-jar-without-manifest, -do-jar-with-mainclass, -do-jar-with-libraries, -do-jar-with-libraries-without-mainclass, -do-jar-with-libraries-without-manifest, jar.natives, android.package, tag.build, create-all-jnlps, build-archive, -post-jar, jar, -javadoc-browse, javadoc, default, -debug-start-debuggee-applet, GlueGen-cpptasks-base.gluegen.cpptasks.detect.os.freebsd.amd64, -debug-start-debuggee-main-test, JOCL-impl.-do-jar-with-libraries-without-mainclass, GlueGen-cpptasks-base.gluegen.cpptasks.detect.os.linux.armv6.armhf, JOCL-impl.-pre-debug-fix, JOCL-impl.-init-macrodef-nbjpda, JOCL-impl.-init-private, GlueGen-cpptasks-base.gluegen.cpptasks.detect.os.solaris.x86, jogamp-env.jogamp.env.validation, GlueGen-cpptasks-base.gluegen.cpptasks.detect.os.osx, GlueGen-cpptasks-base.gluegen.cpptasks.declare.compiler.linux.armv6, JOCL-impl.run, JOCL-impl.-post-jar, -warn-already-built-jar, JOCL-impl.debug-applet, -debug-start-debuggee, JOCL-impl.debug, -deps-clean-init, JOCL-impl.deps-clean, JOCL-impl.-check-call-dep, GlueGen-cpptasks-base.gluegen.cpptasks.detect.os.freebsd, update-headers, -warn-already-built-clean, GlueGen-cpptasks-base.gluegen.cpptasks.detect.os.custom, GlueGen-cpptasks-base.gluegen.cpptasks.detect.os.linux.ppc, -do-not-recompile, GlueGen-cpptasks-base.gluegen.cpptasks.declare.compiler.linux.ia64, -debug-start-debugger-test, -debug-start-debuggee-test, debug-test, GlueGen-cpptasks-base.gluegen.cpptasks.detect.os.solaris.sparc, GlueGen-cpptasks-base.gluegen.cpptasks.declare.compiler.linux.amd64, GlueGen-cpptasks-base.gluegen.cpptasks.declare.compiler.freebsd.amd64, JOCL-impl.-post-init, -debug-start-debugger-stepinto, JOCL-impl.debug-stepinto, JOCL-impl.-debug-start-debuggee-test, GlueGen-cpptasks-base.gluegen.cpptasks.detect.os.refine, GlueGen-cpptasks-base.gluegen.cpptasks.declare.compiler.win32.vc8_x64, GlueGen-cpptasks-base.gluegen.cpptasks.detect.os.linux.armv6.armel, GlueGen-cpptasks-base.setup.java.home.dir.macosx, GlueGen-cpptasks-base.gluegen.cpptasks.declare.compiler.macosx, jar-test, JOCL-impl.-do-jar-with-mainclass, JOCL-impl.-init-user, debug-applet, -do-test-run-single, -post-test-run-single, JOCL-impl.test-single, JOCL-impl.-do-not-recompile, jogamp-env.jogamp.env.init, GlueGen-cpptasks-base.gluegen.cpptasks.initialize, JOCL-impl.-compile-test-depend, JOCL-impl.-do-jar-with-manifest, GlueGen-cpptasks-base.gluegen.cpptasks.detect.os.solaris.sparcv9, -pre-debug-fix, JOCL-impl.-do-debug-fix, GlueGen-cpptasks-base.gluegen.cpptasks.setup.compiler, GlueGen-cpptasks-base.gluegen.cpptasks.declare.compiler.linux.s390, run, GlueGen-cpptasks-base.gluegen.cpptasks.declare.compiler.linux.ppc, -do-debug-fix-test, JOCL-impl.-init-presetdef-jar, JOCL-impl.-post-clean, GlueGen-cpptasks-base.gluegen.cpptasks.detect.os.linux.ia64, JOCL-impl.-debug-start-debugger, JOCL-impl.-init-macrodef-debug, GlueGen-cpptasks-base.gluegen.cpptasks.declare.compiler.environment, JOCL-impl.-debug-start-debuggee, JOCL-impl.debug-fix-test, GlueGen-cpptasks-base.gluegen.cpptasks.detect.os.solaris, GlueGen-cpptasks-base.gluegen.cpptasks.detect.os.linux.sparc, GlueGen-cpptasks-base.setup.java.home.dir, GlueGen-cpptasks-base.gluegen.cpptasks.declare.compiler.solaris32, GlueGen-cpptasks-base.gluegen.cpptasks.declare.compiler.win32, GlueGen-cpptasks-base.gluegen.cpptasks.declare.compiler.linux, JOCL-impl.-pre-pre-compile-test, JOCL-impl.-debug-start-debugger-test, GlueGen-cpptasks-base.gluegen.cpptasks.declare.compiler.linux.mips, deps-clean, -do-clean, -post-clean, JOCL-impl.clean, -debug-start-debugger-main-test, JOCL-impl.debug-test-with-main, JOCL-impl.init, GlueGen-cpptasks-base.gluegen.cpptasks.detect.os.linux.s390x, JOCL-impl.-test-browse, run-applet, GlueGen-cpptasks-base.gluegen.cpptasks.detect.os.windows, JOCL-impl.-do-jar-with-libraries, GlueGen-cpptasks-base.setup.java.home.dir.nonmacosx, GlueGen-cpptasks-base.gluegen.cpptasks.detect.os.linux.s390, JOCL-impl.-debug-start-debugger-main-test, GlueGen-cpptasks-base.gluegen.cpptasks.detect.os.android.armv6.armhf, JOCL-impl.-do-init, JOCL-impl.-pre-pre-compile, JOCL-impl.-do-compile-test-single, JOCL-impl.-init-project, JOCL-impl.-debug-start-debuggee-single, JOCL-impl.compile, run-test-with-main, GlueGen-cpptasks-base.gluegen.cpptasks.detect.os.linux.x86, -maybe-call-dep, JOCL-impl.-javadoc-build, JOCL-impl.-do-jar-with-libraries-without-manifest, JOCL-impl.-init-check, clean-jar-test, JOCL-impl.debug-test, JOCL-impl.compile-single, debug, GlueGen-cpptasks-base.gluegen.cpptasks.detect.os.linux.mips, JOCL-impl.-pre-compile-test, JOCL-impl.-deps-clean-init, JOCL-impl.default, JOCL-impl.-init-private-libraries, JOCL-impl.-debug-start-debugger-stepinto, gluegen.cpptasks.striplibs, GlueGen-cpptasks-base.gluegen.cpptasks.declare.compiler.win32.vc9, GlueGen-cpptasks-base.gluegen.cpptasks.declare.compiler.win32.vc8, JOCL-impl.-init-macrodef-property, GlueGen-cpptasks-base.gluegen.cpptasks.declare.compiler.win32.vc7, GlueGen-cpptasks-base.gluegen.cpptasks.declare.compiler.win32.vc6, GlueGen-properties.gluegen.properties.load.user, GlueGen-cpptasks-base.gluegen.cpptasks.detect.os.android.armv6.armel, debug-test-with-main, GlueGen-cpptasks-base.gluegen.cpptasks.detect.os.hpux, JOCL-impl.compile-test, GlueGen-cpptasks-base.gluegen.cpptasks.declare.compiler, GlueGen-cpptasks-base.gluegen.cpptasks.detect.os.windows.x86, GlueGen-cpptasks-base.gluegen.cpptasks.detect.os.linux.alpha, JOCL-impl.-check-automatic-build, gluegen.cpptasks.setup.compiler, JOCL-impl.-post-compile, JOCL-impl.-do-compile, -do-debug-fix, JOCL-impl.-pre-jar, GlueGen-cpptasks-base.gluegen.cpptasks.declare.compiler.linux.mipsel, JOCL-impl.-pre-test-run-single, GlueGen-cpptasks-base.gluegen.cpptasks.detect.compiler, GlueGen-cpptasks-base.gluegen.cpptasks.declare.compiler.linux.x86, GlueGen-cpptasks-base.gluegen.cpptasks.detect.os.unix, JOCL-impl.compile-test-single, JOCL-impl.-warn-already-built-clean, JOCL-impl.-pre-compile-test-single, GlueGen-cpptasks-base.gluegen.cpptasks.declare.compiler.solaris.sparcv9, JOCL-impl.-pre-init, GlueGen-cpptasks-base.gluegen.cpptasks.detect.os.freebsd.x86, JOCL-impl.-deps-jar-init, JOCL-impl.-init-libraries, JOCL-impl.run-single, JOCL-impl.-do-debug-fix-test, JOCL-impl.javadoc, JOCL-impl.-pre-test-run, GlueGen-cpptasks-base.gluegen.cpptasks.detect.os.solaris.amd64, debug-fix, JOCL-impl.debug-fix, JOCL-impl.-warn-already-built-jar, JOCL-impl.test-report, GlueGen-cpptasks-base.gluegen.cpptasks.declare.compiler.linux.sparc, JOCL-impl.-verify-automatic-build, JOCL-impl.-pre-compile, clean, JOCL-impl.run-applet, debug-stepinto, JOCL-impl.deps-jar, JOCL-impl.-post-compile-test-single, JOCL-impl.-do-compile-test, GlueGen-cpptasks-base.gluegen.cpptasks.declare.compiler.linux.s390x, GlueGen-cpptasks-base.gluegen.cpptasks.declare.compiler.win32.mingw, JOCL-impl.-clean-after-automatic-build, GlueGen-cpptasks-base.gluegen.cpptasks.detect.os.linux, JOCL-impl.run-test-with-main, JOCL-impl.-do-compile-single, GlueGen-cpptasks-base.gluegen.cpptasks.declare.compiler.solaris.amd64, JOCL-impl.-do-clean, JOCL-impl.-do-test-run-single, GlueGen-cpptasks-base.gluegen.cpptasks.declare.compiler.linux.hppa, JOCL-impl.-compile-depend, GlueGen-cpptasks-base.gluegen.cpptasks.detect.os.linux.amd64, JOCL-impl.-debug-start-debuggee-applet, GlueGen-cpptasks-base.gluegen.cpptasks.declare.compiler.freebsd, debug-single, GlueGen-cpptasks-base.gluegen.cpptasks.detect.os.2, JOCL-impl.-init-macrodef-java, GlueGen-cpptasks-base.gluegen.cpptasks.detect.os.1, JOCL-impl.-maybe-call-dep, JOCL-impl.-pre-init-libraries, JOCL-impl.-post-compile-single, debug-fix-test, JOCL-impl.-init-macrodef-junit, GlueGen-cpptasks-base.gluegen.cpptasks.detect.os.linux.mipsel, GlueGen-cpptasks-base.gluegen.cpptasks.detect.os, JOCL-impl.-pre-pre-jar, JOCL-impl.-pre-compile-single, GlueGen-cpptasks-base.gluegen.cpptasks.detect.os.windows.amd64, test-single, test-file, GlueGen-cpptasks-base.gluegen.cpptasks.declare.compiler.linux.alpha, JOCL-impl.-post-test-run-single, JOCL-impl.-do-test-run, JOCL-impl.jar, GlueGen-cpptasks-base.gluegen.cpptasks.detect.os.linux.hppa, JOCL-impl.-javadoc-browse, JOCL-impl.-do-jar-without-manifest, JOCL-impl.-post-test-run, GlueGen-cpptasks-base.gluegen.cpptasks.configure.compiler, GlueGen-cpptasks-base.gluegen.cpptasks.declare.compiler.freebsd.x86, ]

junit.run.local:
    [junit] Implicitly adding C:\apache-ant-1.8.2\lib\ant-launcher.jar;C:\apache-ant-1.8.2\lib\ant.jar;C:\apache-ant-1.8.2\lib\ant-junit.jar;C:\apache-ant-1.8.2\lib\ant-junit4.jar to CLASSPATH
    [junit] Executing 'c:\jdk1.7.0_45_x32\jre\bin\java.exe' with arguments:
    [junit] '-Djnlp.no.jvm.data.model.set=true'
    [junit] '-Xmx256m'
    [junit] '-Djava.library.path=c:\JogAmpSlavex32\workspace\jocl\label\win7-x86_32-amd/build/natives/jocl;../../../jogl/label/win7-x86_32-amd/build/lib;../../../gluegen/label/win7-x86_32-amd/build/obj'
    [junit] '-classpath'
    [junit] 'c:\JogAmpSlavex32\workspace\jocl\label\win7-x86_32-amd\build\jar\jocl.jar;c:\JogAmpSlavex32\workspace\gluegen\label\win7-x86_32-amd\build\gluegen-rt.jar;c:\JogAmpSlavex32\workspace\jogl\label\win7-x86_32-amd\build\jar\jogl-all.jar;c:\JogAmpSlavex32\workspace\jocl\label\win7-x86_32-amd\build\classes;c:\JogAmpSlavex32\workspace\jocl\label\win7-x86_32-amd\lib\junit_4\junit-4.8.1.jar;c:\JogAmpSlavex32\workspace\jocl\label\win7-x86_32-amd\build\test\classes;C:\apache-ant-1.8.2\lib\ant-launcher.jar;C:\apache-ant-1.8.2\lib\ant.jar;C:\apache-ant-1.8.2\lib\ant-junit.jar;C:\apache-ant-1.8.2\lib\ant-junit4.jar'
    [junit] 'org.apache.tools.ant.taskdefs.optional.junit.JUnitTestRunner'
    [junit] 'com.jogamp.opencl.CLBufferTest'
    [junit] 'filtertrace=true'
    [junit] 'haltOnError=false'
    [junit] 'haltOnFailure=false'
    [junit] 'showoutput=true'
    [junit] 'outputtoformatters=true'
    [junit] 'logfailedtests=true'
    [junit] 'logtestlistenerevents=false'
    [junit] 'formatter=org.apache.tools.ant.taskdefs.optional.junit.BriefJUnitResultFormatter'
    [junit] 'formatter=org.apache.tools.ant.taskdefs.optional.junit.XMLJUnitResultFormatter,c:\JogAmpSlavex32\workspace\jocl\label\win7-x86_32-amd\build\test\results\TEST-com.jogamp.opencl.CLBufferTest.xml'
    [junit] 'crashfile=c:\JogAmpSlavex32\workspace\jocl\label\win7-x86_32-amd\build\junitvmwatcher516319502243653278.properties'
    [junit] 'propsfile=c:\JogAmpSlavex32\workspace\jocl\label\win7-x86_32-amd\build\junit5685014782498537145.properties'
    [junit] 
    [junit] The ' characters around the executable and arguments are
    [junit] not part of the command.
    [junit] Testsuite: com.jogamp.opencl.CLBufferTest
    [junit]  - - - highLevelTest; create buffer test - - - 
    [junit] #
    [junit] # A fatal error has been detected by the Java Runtime Environment:
    [junit] #
    [junit] #  EXCEPTION_ACCESS_VIOLATION (0xc0000005) at pc=0x77e8e3c6, pid=3868, tid=1704
    [junit] #
    [junit] # JRE version: Java(TM) SE Runtime Environment (7.0_45-b18) (build 1.7.0_45-b18)
    [junit] # Java VM: Java HotSpot(TM) Client VM (24.45-b08 mixed mode windows-x86 )
    [junit] # Problematic frame:
    [junit] # C  [ntdll.dll+0x2e3c6]
    [junit] #
    [junit] # Failed to write core dump. Minidumps are not enabled by default on client versions of Windows
    [junit] #
    [junit] # An error report file with more information is saved as:
    [junit] # c:\JogAmpSlavex32\workspace\jocl\label\win7-x86_32-amd\hs_err_pid3868.log
    [junit] #
    [junit] # If you would like to submit a bug report, please visit:
    [junit] #   http://bugreport.sun.com/bugreport/crash.jsp
    [junit] # The crash happened outside the Java Virtual Machine in native code.
    [junit] # See problematic frame for where to report the bug.
    [junit] #
    [junit] Using System properties {java.runtime.name=Java(TM) SE Runtime Environment, sun.boot.library.path=c:\jdk1.7.0_45_x32\jre\bin, java.vm.version=24.45-b08, ant.library.dir=C:\apache-ant-1.8.2\lib, java.vm.vendor=Oracle Corporation, java.vendor.url=http://java.oracle.com/, path.separator=;, java.vm.name=Java HotSpot(TM) Client VM, file.encoding.pkg=sun.io, user.country=US, user.script=, sun.java.launcher=SUN_STANDARD, sun.os.patch.level=, java.vm.specification.name=Java Virtual Machine Specification, user.dir=c:\JogAmpSlavex32\workspace\jocl\label\win7-x86_32-amd, java.runtime.version=1.7.0_45-b18, java.awt.graphicsenv=sun.awt.Win32GraphicsEnvironment, java.endorsed.dirs=c:\jdk1.7.0_45_x32\jre\lib\endorsed, os.arch=x86, java.io.tmpdir=C:\cygwin\tmp\, line.separator=
    [junit] , java.vm.specification.vendor=Oracle Corporation, user.variant=, os.name=Windows 7, ant.home=C:\apache-ant-1.8.2\bin\.., sun.jnu.encoding=Cp1252, java.library.path=c:\jdk1.7.0_45_x32\bin;C:\Windows\Sun\Java\bin;C:\Windows\system32;C:\Windows;c:\jdk1.7.0_45_x32\bin;C:\apache-ant-1.8.2\bin;c:\mingw\bin;C:\cygwin\bin;C:\Program Files\7-Zip;C:\cygwin\usr\local\bin;C:\cygwin\bin;C:\Program Files (x86)\AMD APP\bin\x86_64;C:\Program Files (x86)\AMD APP\bin\x86;C:\Users\jogamp-admin\Documents\ATI Stream\bin\x86_64;C:\Users\jogamp-admin\Documents\ATI Stream\bin\x86;C:\Windows\system32;C:\Windows;C:\Windows\System32\Wbem;C:\Windows\System32\WindowsPowerShell\v1.0;C:\Program Files (x86)\ATI Technologies\ATI.ACE\Core-Static;C:\Program Files (x86)\Common Files\Roxio Shared\DLLShared;C:\Program Files (x86)\Common Files\Roxio Shared\10.0\DLLShared;C:\cygwin\bin;C:\Program Files (x86)\ATI Stream\Tools\Stream KernelAnalyzer 1.6;C:\cygwin\lib\lapack;., java.specification.name=Java Platform API Specification, java.class.version=51.0, sun.management.compiler=HotSpot Client Compiler, os.version=6.1, user.home=C:\Users\jogamp, user.timezone=Europe/Athens, java.awt.printerjob=sun.awt.windows.WPrinterJob, file.encoding=Cp1252, java.specification.version=1.7, java.class.path=C:\apache-ant-1.8.2\bin\..\lib\ant-launcher.jar;C:\apache-ant-1.8.2\lib\ant-antlr.jar;C:\apache-ant-1.8.2\lib\ant-apache-bcel.jar;C:\apache-ant-1.8.2\lib\ant-apache-bsf.jar;C:\apache-ant-1.8.2\lib\ant-apache-log4j.jar;C:\apache-ant-1.8.2\lib\ant-apache-oro.jar;C:\apache-ant-1.8.2\lib\ant-apache-regexp.jar;C:\apache-ant-1.8.2\lib\ant-apache-resolver.jar;C:\apache-ant-1.8.2\lib\ant-apache-xalan2.jar;C:\apache-ant-1.8.2\lib\ant-commons-logging.jar;C:\apache-ant-1.8.2\lib\ant-commons-net.jar;C:\apache-ant-1.8.2\lib\ant-jai.jar;C:\apache-ant-1.8.2\lib\ant-javamail.jar;C:\apache-ant-1.8.2\lib\ant-jdepend.jar;C:\apache-ant-1.8.2\lib\ant-jmf.jar;C:\apache-ant-1.8.2\lib\ant-jsch.jar;C:\apache-ant-1.8.2\lib\ant-junit.jar;C:\apache-ant-1.8.2\lib\ant-junit4.jar;C:\apache-ant-1.8.2\lib\ant-launcher.jar;C:\apache-ant-1.8.2\lib\ant-netrexx.jar;C:\apache-ant-1.8.2\lib\ant-swing.jar;C:\apache-ant-1.8.2\lib\ant-testutil.jar;C:\apache-ant-1.8.2\lib\ant.jar;c:\jdk1.7.0_45_x32\lib\tools.jar, user.name=jogamp, java.vm.specification.version=1.7, sun.java.command=org.apache.tools.ant.launch.Launcher -Dlabel win7-x86_32-amd -Djocl.basename jocl -Djogl.basename jogl -Dgluegen.basename gluegen -Dgluegen.root ../../../gluegen/label/win7-x86_32-amd -Djocl.build.id 2013-11-01_20-56-20 -Djocl.build.number 873 -Djocl.build.commit cb27127c0be28cc1c864bcf5b6c94b860d3590d2 -Djogl.root ../../../jogl/label/win7-x86_32-amd -Djocl.build.branch origin/master -v clean-jar-test, java.home=c:\jdk1.7.0_45_x32\jre, sun.arch.data.model=32, user.language=en, java.specification.vendor=Oracle Corporation, awt.toolkit=sun.awt.windows.WToolkit, java.vm.info=mixed mode, java.version=1.7.0_45, java.ext.dirs=c:\jdk1.7.0_45_x32\jre\lib\ext;C:\Windows\Sun\Java\lib\ext, sun.boot.class.path=c:\jdk1.7.0_45_x32\jre\lib\resources.jar;c:\jdk1.7.0_45_x32\jre\lib\rt.jar;c:\jdk1.7.0_45_x32\jre\lib\sunrsasign.jar;c:\jdk1.7.0_45_x32\jre\lib\jsse.jar;c:\jdk1.7.0_45_x32\jre\lib\jce.jar;c:\jdk1.7.0_45_x32\jre\lib\charsets.jar;c:\jdk1.7.0_45_x32\jre\lib\jfr.jar;c:\jdk1.7.0_45_x32\jre\classes, java.vendor=Oracle Corporation, file.separator=\, java.vendor.url.bug=http://bugreport.sun.com/bugreport/, sun.io.unicode.encoding=UnicodeLittle, sun.cpu.endian=little, sun.desktop=windows, sun.cpu.isalist=pentium_pro+mmx pentium_pro pentium+mmx pentium i486 i386 i86}
    [junit] Testsuite: com.jogamp.opencl.CLBufferTest
    [junit] Tests run: 1, Failures: 0, Errors: 1, Time elapsed: 0 sec
    [junit] 
    [junit] Testcase: com.jogamp.opencl.CLBufferTest:createBufferTest:	Caused an ERROR
    [junit] Forked Java VM exited abnormally. Please note the time in the report does not reflect the time until the VM exit.
    [junit] junit.framework.AssertionFailedError: Forked Java VM exited abnormally. Please note the time in the report does not reflect the time until the VM exit.
    [junit] 
    [junit] 
    [junit] Test com.jogamp.opencl.CLBufferTest FAILED (crashed)
Override ignored for property "tests.failed"
    [junit] Implicitly adding C:\apache-ant-1.8.2\lib\ant-launcher.jar;C:\apache-ant-1.8.2\lib\ant.jar;C:\apache-ant-1.8.2\lib\ant-junit.jar;C:\apache-ant-1.8.2\lib\ant-junit4.jar to CLASSPATH
    [junit] Executing 'c:\jdk1.7.0_45_x32\jre\bin\java.exe' with arguments:
    [junit] '-Djnlp.no.jvm.data.model.set=true'
    [junit] '-Xmx256m'
    [junit] '-Djava.library.path=c:\JogAmpSlavex32\workspace\jocl\label\win7-x86_32-amd/build/natives/jocl;../../../jogl/label/win7-x86_32-amd/build/lib;../../../gluegen/label/win7-x86_32-amd/build/obj'
    [junit] '-classpath'
    [junit] 'c:\JogAmpSlavex32\workspace\jocl\label\win7-x86_32-amd\build\jar\jocl.jar;c:\JogAmpSlavex32\workspace\gluegen\label\win7-x86_32-amd\build\gluegen-rt.jar;c:\JogAmpSlavex32\workspace\jogl\label\win7-x86_32-amd\build\jar\jogl-all.jar;c:\JogAmpSlavex32\workspace\jocl\label\win7-x86_32-amd\build\classes;c:\JogAmpSlavex32\workspace\jocl\label\win7-x86_32-amd\lib\junit_4\junit-4.8.1.jar;c:\JogAmpSlavex32\workspace\jocl\label\win7-x86_32-amd\build\test\classes;C:\apache-ant-1.8.2\lib\ant-launcher.jar;C:\apache-ant-1.8.2\lib\ant.jar;C:\apache-ant-1.8.2\lib\ant-junit.jar;C:\apache-ant-1.8.2\lib\ant-junit4.jar'
    [junit] 'org.apache.tools.ant.taskdefs.optional.junit.JUnitTestRunner'
    [junit] 'com.jogamp.opencl.CLCommandQueueTest'
    [junit] 'filtertrace=true'
    [junit] 'haltOnError=false'
    [junit] 'haltOnFailure=false'
    [junit] 'showoutput=true'
    [junit] 'outputtoformatters=true'
    [junit] 'logfailedtests=true'
    [junit] 'logtestlistenerevents=false'
    [junit] 'formatter=org.apache.tools.ant.taskdefs.optional.junit.BriefJUnitResultFormatter'
    [junit] 'formatter=org.apache.tools.ant.taskdefs.optional.junit.XMLJUnitResultFormatter,c:\JogAmpSlavex32\workspace\jocl\label\win7-x86_32-amd\build\test\results\TEST-com.jogamp.opencl.CLCommandQueueTest.xml'
    [junit] 'crashfile=c:\JogAmpSlavex32\workspace\jocl\label\win7-x86_32-amd\build\junitvmwatcher7419387477161440437.properties'
    [junit] 'propsfile=c:\JogAmpSlavex32\workspace\jocl\label\win7-x86_32-amd\build\junit5882146675673123472.properties'
    [junit] 
    [junit] The ' characters around the executable and arguments are
    [junit] not part of the command.
    [junit] Testsuite: com.jogamp.opencl.CLCommandQueueTest
    [junit]  - - - event synchronization test - - - 
    [junit] #
    [junit] # A fatal error has been detected by the Java Runtime Environment:
    [junit] #
    [junit] #  EXCEPTION_ACCESS_VIOLATION (0xc0000005) at pc=0x77e8e3c6, pid=4092, tid=632
    [junit] #
    [junit] # JRE version: Java(TM) SE Runtime Environment (7.0_45-b18) (build 1.7.0_45-b18)
    [junit] # Java VM: Java HotSpot(TM) Client VM (24.45-b08 mixed mode windows-x86 )
    [junit] # Problematic frame:
    [junit] # C  [ntdll.dll+0x2e3c6]
    [junit] #
    [junit] # Failed to write core dump. Minidumps are not enabled by default on client versions of Windows
    [junit] #
    [junit] # An error report file with more information is saved as:
    [junit] # c:\JogAmpSlavex32\workspace\jocl\label\win7-x86_32-amd\hs_err_pid4092.log
    [junit] #
    [junit] # If you would like to submit a bug report, please visit:
    [junit] #   http://bugreport.sun.com/bugreport/crash.jsp
    [junit] # The crash happened outside the Java Virtual Machine in native code.
    [junit] # See problematic frame for where to report the bug.
    [junit] #
    [junit] Using System properties {java.runtime.name=Java(TM) SE Runtime Environment, sun.boot.library.path=c:\jdk1.7.0_45_x32\jre\bin, java.vm.version=24.45-b08, ant.library.dir=C:\apache-ant-1.8.2\lib, java.vm.vendor=Oracle Corporation, java.vendor.url=http://java.oracle.com/, path.separator=;, java.vm.name=Java HotSpot(TM) Client VM, file.encoding.pkg=sun.io, user.country=US, user.script=, sun.java.launcher=SUN_STANDARD, sun.os.patch.level=, java.vm.specification.name=Java Virtual Machine Specification, user.dir=c:\JogAmpSlavex32\workspace\jocl\label\win7-x86_32-amd, java.runtime.version=1.7.0_45-b18, java.awt.graphicsenv=sun.awt.Win32GraphicsEnvironment, java.endorsed.dirs=c:\jdk1.7.0_45_x32\jre\lib\endorsed, os.arch=x86, java.io.tmpdir=C:\cygwin\tmp\, line.separator=
    [junit] , java.vm.specification.vendor=Oracle Corporation, user.variant=, os.name=Windows 7, ant.home=C:\apache-ant-1.8.2\bin\.., sun.jnu.encoding=Cp1252, java.library.path=c:\jdk1.7.0_45_x32\bin;C:\Windows\Sun\Java\bin;C:\Windows\system32;C:\Windows;c:\jdk1.7.0_45_x32\bin;C:\apache-ant-1.8.2\bin;c:\mingw\bin;C:\cygwin\bin;C:\Program Files\7-Zip;C:\cygwin\usr\local\bin;C:\cygwin\bin;C:\Program Files (x86)\AMD APP\bin\x86_64;C:\Program Files (x86)\AMD APP\bin\x86;C:\Users\jogamp-admin\Documents\ATI Stream\bin\x86_64;C:\Users\jogamp-admin\Documents\ATI Stream\bin\x86;C:\Windows\system32;C:\Windows;C:\Windows\System32\Wbem;C:\Windows\System32\WindowsPowerShell\v1.0;C:\Program Files (x86)\ATI Technologies\ATI.ACE\Core-Static;C:\Program Files (x86)\Common Files\Roxio Shared\DLLShared;C:\Program Files (x86)\Common Files\Roxio Shared\10.0\DLLShared;C:\cygwin\bin;C:\Program Files (x86)\ATI Stream\Tools\Stream KernelAnalyzer 1.6;C:\cygwin\lib\lapack;., java.specification.name=Java Platform API Specification, java.class.version=51.0, sun.management.compiler=HotSpot Client Compiler, os.version=6.1, user.home=C:\Users\jogamp, user.timezone=Europe/Athens, java.awt.printerjob=sun.awt.windows.WPrinterJob, file.encoding=Cp1252, java.specification.version=1.7, java.class.path=C:\apache-ant-1.8.2\bin\..\lib\ant-launcher.jar;C:\apache-ant-1.8.2\lib\ant-antlr.jar;C:\apache-ant-1.8.2\lib\ant-apache-bcel.jar;C:\apache-ant-1.8.2\lib\ant-apache-bsf.jar;C:\apache-ant-1.8.2\lib\ant-apache-log4j.jar;C:\apache-ant-1.8.2\lib\ant-apache-oro.jar;C:\apache-ant-1.8.2\lib\ant-apache-regexp.jar;C:\apache-ant-1.8.2\lib\ant-apache-resolver.jar;C:\apache-ant-1.8.2\lib\ant-apache-xalan2.jar;C:\apache-ant-1.8.2\lib\ant-commons-logging.jar;C:\apache-ant-1.8.2\lib\ant-commons-net.jar;C:\apache-ant-1.8.2\lib\ant-jai.jar;C:\apache-ant-1.8.2\lib\ant-javamail.jar;C:\apache-ant-1.8.2\lib\ant-jdepend.jar;C:\apache-ant-1.8.2\lib\ant-jmf.jar;C:\apache-ant-1.8.2\lib\ant-jsch.jar;C:\apache-ant-1.8.2\lib\ant-junit.jar;C:\apache-ant-1.8.2\lib\ant-junit4.jar;C:\apache-ant-1.8.2\lib\ant-launcher.jar;C:\apache-ant-1.8.2\lib\ant-netrexx.jar;C:\apache-ant-1.8.2\lib\ant-swing.jar;C:\apache-ant-1.8.2\lib\ant-testutil.jar;C:\apache-ant-1.8.2\lib\ant.jar;c:\jdk1.7.0_45_x32\lib\tools.jar, user.name=jogamp, java.vm.specification.version=1.7, sun.java.command=org.apache.tools.ant.launch.Launcher -Dlabel win7-x86_32-amd -Djocl.basename jocl -Djogl.basename jogl -Dgluegen.basename gluegen -Dgluegen.root ../../../gluegen/label/win7-x86_32-amd -Djocl.build.id 2013-11-01_20-56-20 -Djocl.build.number 873 -Djocl.build.commit cb27127c0be28cc1c864bcf5b6c94b860d3590d2 -Djogl.root ../../../jogl/label/win7-x86_32-amd -Djocl.build.branch origin/master -v clean-jar-test, java.home=c:\jdk1.7.0_45_x32\jre, sun.arch.data.model=32, user.language=en, java.specification.vendor=Oracle Corporation, awt.toolkit=sun.awt.windows.WToolkit, java.vm.info=mixed mode, java.version=1.7.0_45, java.ext.dirs=c:\jdk1.7.0_45_x32\jre\lib\ext;C:\Windows\Sun\Java\lib\ext, sun.boot.class.path=c:\jdk1.7.0_45_x32\jre\lib\resources.jar;c:\jdk1.7.0_45_x32\jre\lib\rt.jar;c:\jdk1.7.0_45_x32\jre\lib\sunrsasign.jar;c:\jdk1.7.0_45_x32\jre\lib\jsse.jar;c:\jdk1.7.0_45_x32\jre\lib\jce.jar;c:\jdk1.7.0_45_x32\jre\lib\charsets.jar;c:\jdk1.7.0_45_x32\jre\lib\jfr.jar;c:\jdk1.7.0_45_x32\jre\classes, java.vendor=Oracle Corporation, file.separator=\, java.vendor.url.bug=http://bugreport.sun.com/bugreport/, sun.io.unicode.encoding=UnicodeLittle, sun.cpu.endian=little, sun.desktop=windows, sun.cpu.isalist=pentium_pro+mmx pentium_pro pentium+mmx pentium i486 i386 i86}
    [junit] Testsuite: com.jogamp.opencl.CLCommandQueueTest
    [junit] Tests run: 1, Failures: 0, Errors: 1, Time elapsed: 0 sec
    [junit] 
    [junit] Testcase: com.jogamp.opencl.CLCommandQueueTest:eventsTest:	Caused an ERROR
    [junit] Forked Java VM exited abnormally. Please note the time in the report does not reflect the time until the VM exit.
    [junit] junit.framework.AssertionFailedError: Forked Java VM exited abnormally. Please note the time in the report does not reflect the time until the VM exit.
    [junit] 
    [junit] 
    [junit] Test com.jogamp.opencl.CLCommandQueueTest FAILED (crashed)
Override ignored for property "tests.failed"
Override ignored for property "tests.failed"
    [junit] Implicitly adding C:\apache-ant-1.8.2\lib\ant-launcher.jar;C:\apache-ant-1.8.2\lib\ant.jar;C:\apache-ant-1.8.2\lib\ant-junit.jar;C:\apache-ant-1.8.2\lib\ant-junit4.jar to CLASSPATH
    [junit] Executing 'c:\jdk1.7.0_45_x32\jre\bin\java.exe' with arguments:
    [junit] '-Djnlp.no.jvm.data.model.set=true'
    [junit] '-Xmx256m'
    [junit] '-Djava.library.path=c:\JogAmpSlavex32\workspace\jocl\label\win7-x86_32-amd/build/natives/jocl;../../../jogl/label/win7-x86_32-amd/build/lib;../../../gluegen/label/win7-x86_32-amd/build/obj'
    [junit] '-classpath'
    [junit] 'c:\JogAmpSlavex32\workspace\jocl\label\win7-x86_32-amd\build\jar\jocl.jar;c:\JogAmpSlavex32\workspace\gluegen\label\win7-x86_32-amd\build\gluegen-rt.jar;c:\JogAmpSlavex32\workspace\jogl\label\win7-x86_32-amd\build\jar\jogl-all.jar;c:\JogAmpSlavex32\workspace\jocl\label\win7-x86_32-amd\build\classes;c:\JogAmpSlavex32\workspace\jocl\label\win7-x86_32-amd\lib\junit_4\junit-4.8.1.jar;c:\JogAmpSlavex32\workspace\jocl\label\win7-x86_32-amd\build\test\classes;C:\apache-ant-1.8.2\lib\ant-launcher.jar;C:\apache-ant-1.8.2\lib\ant.jar;C:\apache-ant-1.8.2\lib\ant-junit.jar;C:\apache-ant-1.8.2\lib\ant-junit4.jar'
    [junit] 'org.apache.tools.ant.taskdefs.optional.junit.JUnitTestRunner'
    [junit] 'com.jogamp.opencl.CLExceptionTest'
    [junit] 'filtertrace=true'
    [junit] 'haltOnError=false'
    [junit] 'haltOnFailure=false'
    [junit] 'showoutput=true'
    [junit] 'outputtoformatters=true'
    [junit] 'logfailedtests=true'
    [junit] 'logtestlistenerevents=false'
    [junit] 'formatter=org.apache.tools.ant.taskdefs.optional.junit.BriefJUnitResultFormatter'
    [junit] 'formatter=org.apache.tools.ant.taskdefs.optional.junit.XMLJUnitResultFormatter,c:\JogAmpSlavex32\workspace\jocl\label\win7-x86_32-amd\build\test\results\TEST-com.jogamp.opencl.CLExceptionTest.xml'
    [junit] 'crashfile=c:\JogAmpSlavex32\workspace\jocl\label\win7-x86_32-amd\build\junitvmwatcher518826815367032028.properties'
    [junit] 'propsfile=c:\JogAmpSlavex32\workspace\jocl\label\win7-x86_32-amd\build\junit6130208354783495905.properties'
    [junit] 
    [junit] The ' characters around the executable and arguments are
    [junit] not part of the command.
    [junit] Testsuite: com.jogamp.opencl.CLExceptionTest
    [junit] Tests run: 1, Failures: 0, Errors: 0, Time elapsed: 0.109 sec
    [junit] 
    [junit] Implicitly adding C:\apache-ant-1.8.2\lib\ant-launcher.jar;C:\apache-ant-1.8.2\lib\ant.jar;C:\apache-ant-1.8.2\lib\ant-junit.jar;C:\apache-ant-1.8.2\lib\ant-junit4.jar to CLASSPATH
    [junit] Executing 'c:\jdk1.7.0_45_x32\jre\bin\java.exe' with arguments:
    [junit] '-Djnlp.no.jvm.data.model.set=true'
    [junit] '-Xmx256m'
    [junit] '-Djava.library.path=c:\JogAmpSlavex32\workspace\jocl\label\win7-x86_32-amd/build/natives/jocl;../../../jogl/label/win7-x86_32-amd/build/lib;../../../gluegen/label/win7-x86_32-amd/build/obj'
    [junit] '-classpath'
    [junit] 'c:\JogAmpSlavex32\workspace\jocl\label\win7-x86_32-amd\build\jar\jocl.jar;c:\JogAmpSlavex32\workspace\gluegen\label\win7-x86_32-amd\build\gluegen-rt.jar;c:\JogAmpSlavex32\workspace\jogl\label\win7-x86_32-amd\build\jar\jogl-all.jar;c:\JogAmpSlavex32\workspace\jocl\label\win7-x86_32-amd\build\classes;c:\JogAmpSlavex32\workspace\jocl\label\win7-x86_32-amd\lib\junit_4\junit-4.8.1.jar;c:\JogAmpSlavex32\workspace\jocl\label\win7-x86_32-amd\build\test\classes;C:\apache-ant-1.8.2\lib\ant-launcher.jar;C:\apache-ant-1.8.2\lib\ant.jar;C:\apache-ant-1.8.2\lib\ant-junit.jar;C:\apache-ant-1.8.2\lib\ant-junit4.jar'
    [junit] 'org.apache.tools.ant.taskdefs.optional.junit.JUnitTestRunner'
    [junit] 'com.jogamp.opencl.CLImageTest'
    [junit] 'filtertrace=true'
    [junit] 'haltOnError=false'
    [junit] 'haltOnFailure=false'
    [junit] 'showoutput=true'
    [junit] 'outputtoformatters=true'
    [junit] 'logfailedtests=true'
    [junit] 'logtestlistenerevents=false'
    [junit] 'formatter=org.apache.tools.ant.taskdefs.optional.junit.BriefJUnitResultFormatter'
    [junit] 'formatter=org.apache.tools.ant.taskdefs.optional.junit.XMLJUnitResultFormatter,c:\JogAmpSlavex32\workspace\jocl\label\win7-x86_32-amd\build\test\results\TEST-com.jogamp.opencl.CLImageTest.xml'
    [junit] 'crashfile=c:\JogAmpSlavex32\workspace\jocl\label\win7-x86_32-amd\build\junitvmwatcher4635622178206783590.properties'
    [junit] 'propsfile=c:\JogAmpSlavex32\workspace\jocl\label\win7-x86_32-amd\build\junit4482676715694976126.properties'
    [junit] 
    [junit] The ' characters around the executable and arguments are
    [junit] not part of the command.
    [junit] Testsuite: com.jogamp.opencl.CLImageTest
    [junit] #
    [junit] # A fatal error has been detected by the Java Runtime Environment:
    [junit] #
    [junit] #  EXCEPTION_ACCESS_VIOLATION (0xc0000005) at pc=0x77e8e3c6, pid=4320, tid=1844
    [junit] #
    [junit] # JRE version: Java(TM) SE Runtime Environment (7.0_45-b18) (build 1.7.0_45-b18)
    [junit] # Java VM: Java HotSpot(TM) Client VM (24.45-b08 mixed mode windows-x86 )
    [junit] # Problematic frame:
    [junit] # C  [ntdll.dll+0x2e3c6]
    [junit] #
    [junit] # Failed to write core dump. Minidumps are not enabled by default on client versions of Windows
    [junit] #
    [junit] # An error report file with more information is saved as:
    [junit] # c:\JogAmpSlavex32\workspace\jocl\label\win7-x86_32-amd\hs_err_pid4320.log
    [junit] #
    [junit] # If you would like to submit a bug report, please visit:
    [junit] #   http://bugreport.sun.com/bugreport/crash.jsp
    [junit] # The crash happened outside the Java Virtual Machine in native code.
    [junit] # See problematic frame for where to report the bug.
    [junit] #
    [junit] Using System properties {java.runtime.name=Java(TM) SE Runtime Environment, sun.boot.library.path=c:\jdk1.7.0_45_x32\jre\bin, java.vm.version=24.45-b08, ant.library.dir=C:\apache-ant-1.8.2\lib, java.vm.vendor=Oracle Corporation, java.vendor.url=http://java.oracle.com/, path.separator=;, java.vm.name=Java HotSpot(TM) Client VM, file.encoding.pkg=sun.io, user.country=US, user.script=, sun.java.launcher=SUN_STANDARD, sun.os.patch.level=, java.vm.specification.name=Java Virtual Machine Specification, user.dir=c:\JogAmpSlavex32\workspace\jocl\label\win7-x86_32-amd, java.runtime.version=1.7.0_45-b18, java.awt.graphicsenv=sun.awt.Win32GraphicsEnvironment, java.endorsed.dirs=c:\jdk1.7.0_45_x32\jre\lib\endorsed, os.arch=x86, java.io.tmpdir=C:\cygwin\tmp\, line.separator=
    [junit] , java.vm.specification.vendor=Oracle Corporation, user.variant=, os.name=Windows 7, ant.home=C:\apache-ant-1.8.2\bin\.., sun.jnu.encoding=Cp1252, java.library.path=c:\jdk1.7.0_45_x32\bin;C:\Windows\Sun\Java\bin;C:\Windows\system32;C:\Windows;c:\jdk1.7.0_45_x32\bin;C:\apache-ant-1.8.2\bin;c:\mingw\bin;C:\cygwin\bin;C:\Program Files\7-Zip;C:\cygwin\usr\local\bin;C:\cygwin\bin;C:\Program Files (x86)\AMD APP\bin\x86_64;C:\Program Files (x86)\AMD APP\bin\x86;C:\Users\jogamp-admin\Documents\ATI Stream\bin\x86_64;C:\Users\jogamp-admin\Documents\ATI Stream\bin\x86;C:\Windows\system32;C:\Windows;C:\Windows\System32\Wbem;C:\Windows\System32\WindowsPowerShell\v1.0;C:\Program Files (x86)\ATI Technologies\ATI.ACE\Core-Static;C:\Program Files (x86)\Common Files\Roxio Shared\DLLShared;C:\Program Files (x86)\Common Files\Roxio Shared\10.0\DLLShared;C:\cygwin\bin;C:\Program Files (x86)\ATI Stream\Tools\Stream KernelAnalyzer 1.6;C:\cygwin\lib\lapack;., java.specification.name=Java Platform API Specification, java.class.version=51.0, sun.management.compiler=HotSpot Client Compiler, os.version=6.1, user.home=C:\Users\jogamp, user.timezone=Europe/Athens, java.awt.printerjob=sun.awt.windows.WPrinterJob, file.encoding=Cp1252, java.specification.version=1.7, java.class.path=C:\apache-ant-1.8.2\bin\..\lib\ant-launcher.jar;C:\apache-ant-1.8.2\lib\ant-antlr.jar;C:\apache-ant-1.8.2\lib\ant-apache-bcel.jar;C:\apache-ant-1.8.2\lib\ant-apache-bsf.jar;C:\apache-ant-1.8.2\lib\ant-apache-log4j.jar;C:\apache-ant-1.8.2\lib\ant-apache-oro.jar;C:\apache-ant-1.8.2\lib\ant-apache-regexp.jar;C:\apache-ant-1.8.2\lib\ant-apache-resolver.jar;C:\apache-ant-1.8.2\lib\ant-apache-xalan2.jar;C:\apache-ant-1.8.2\lib\ant-commons-logging.jar;C:\apache-ant-1.8.2\lib\ant-commons-net.jar;C:\apache-ant-1.8.2\lib\ant-jai.jar;C:\apache-ant-1.8.2\lib\ant-javamail.jar;C:\apache-ant-1.8.2\lib\ant-jdepend.jar;C:\apache-ant-1.8.2\lib\ant-jmf.jar;C:\apache-ant-1.8.2\lib\ant-jsch.jar;C:\apache-ant-1.8.2\lib\ant-junit.jar;C:\apache-ant-1.8.2\lib\ant-junit4.jar;C:\apache-ant-1.8.2\lib\ant-launcher.jar;C:\apache-ant-1.8.2\lib\ant-netrexx.jar;C:\apache-ant-1.8.2\lib\ant-swing.jar;C:\apache-ant-1.8.2\lib\ant-testutil.jar;C:\apache-ant-1.8.2\lib\ant.jar;c:\jdk1.7.0_45_x32\lib\tools.jar, user.name=jogamp, java.vm.specification.version=1.7, sun.java.command=org.apache.tools.ant.launch.Launcher -Dlabel win7-x86_32-amd -Djocl.basename jocl -Djogl.basename jogl -Dgluegen.basename gluegen -Dgluegen.root ../../../gluegen/label/win7-x86_32-amd -Djocl.build.id 2013-11-01_20-56-20 -Djocl.build.number 873 -Djocl.build.commit cb27127c0be28cc1c864bcf5b6c94b860d3590d2 -Djogl.root ../../../jogl/label/win7-x86_32-amd -Djocl.build.branch origin/master -v clean-jar-test, java.home=c:\jdk1.7.0_45_x32\jre, sun.arch.data.model=32, user.language=en, java.specification.vendor=Oracle Corporation, awt.toolkit=sun.awt.windows.WToolkit, java.vm.info=mixed mode, java.version=1.7.0_45, java.ext.dirs=c:\jdk1.7.0_45_x32\jre\lib\ext;C:\Windows\Sun\Java\lib\ext, sun.boot.class.path=c:\jdk1.7.0_45_x32\jre\lib\resources.jar;c:\jdk1.7.0_45_x32\jre\lib\rt.jar;c:\jdk1.7.0_45_x32\jre\lib\sunrsasign.jar;c:\jdk1.7.0_45_x32\jre\lib\jsse.jar;c:\jdk1.7.0_45_x32\jre\lib\jce.jar;c:\jdk1.7.0_45_x32\jre\lib\charsets.jar;c:\jdk1.7.0_45_x32\jre\lib\jfr.jar;c:\jdk1.7.0_45_x32\jre\classes, java.vendor=Oracle Corporation, file.separator=\, java.vendor.url.bug=http://bugreport.sun.com/bugreport/, sun.io.unicode.encoding=UnicodeLittle, sun.cpu.endian=little, sun.desktop=windows, sun.cpu.isalist=pentium_pro+mmx pentium_pro pentium+mmx pentium i486 i386 i86}
    [junit] Testsuite: com.jogamp.opencl.CLImageTest
    [junit] Tests run: 1, Failures: 0, Errors: 1, Time elapsed: 0 sec
    [junit] 
    [junit] Testcase: com.jogamp.opencl.CLImageTest:supportedImageFormatsTest:	Caused an ERROR
    [junit] Forked Java VM exited abnormally. Please note the time in the report does not reflect the time until the VM exit.
    [junit] junit.framework.AssertionFailedError: Forked Java VM exited abnormally. Please note the time in the report does not reflect the time until the VM exit.
    [junit] 
    [junit] 
    [junit] Test com.jogamp.opencl.CLImageTest FAILED (crashed)
Override ignored for property "tests.failed"
Override ignored for property "tests.failed"
    [junit] Implicitly adding C:\apache-ant-1.8.2\lib\ant-launcher.jar;C:\apache-ant-1.8.2\lib\ant.jar;C:\apache-ant-1.8.2\lib\ant-junit.jar;C:\apache-ant-1.8.2\lib\ant-junit4.jar to CLASSPATH
    [junit] Executing 'c:\jdk1.7.0_45_x32\jre\bin\java.exe' with arguments:
    [junit] '-Djnlp.no.jvm.data.model.set=true'
    [junit] '-Xmx256m'
    [junit] '-Djava.library.path=c:\JogAmpSlavex32\workspace\jocl\label\win7-x86_32-amd/build/natives/jocl;../../../jogl/label/win7-x86_32-amd/build/lib;../../../gluegen/label/win7-x86_32-amd/build/obj'
    [junit] '-classpath'
    [junit] 'c:\JogAmpSlavex32\workspace\jocl\label\win7-x86_32-amd\build\jar\jocl.jar;c:\JogAmpSlavex32\workspace\gluegen\label\win7-x86_32-amd\build\gluegen-rt.jar;c:\JogAmpSlavex32\workspace\jogl\label\win7-x86_32-amd\build\jar\jogl-all.jar;c:\JogAmpSlavex32\workspace\jocl\label\win7-x86_32-amd\build\classes;c:\JogAmpSlavex32\workspace\jocl\label\win7-x86_32-amd\lib\junit_4\junit-4.8.1.jar;c:\JogAmpSlavex32\workspace\jocl\label\win7-x86_32-amd\build\test\classes;C:\apache-ant-1.8.2\lib\ant-launcher.jar;C:\apache-ant-1.8.2\lib\ant.jar;C:\apache-ant-1.8.2\lib\ant-junit.jar;C:\apache-ant-1.8.2\lib\ant-junit4.jar'
    [junit] 'org.apache.tools.ant.taskdefs.optional.junit.JUnitTestRunner'
    [junit] 'com.jogamp.opencl.CLProgramTest'
    [junit] 'filtertrace=true'
    [junit] 'haltOnError=false'
    [junit] 'haltOnFailure=false'
    [junit] 'showoutput=true'
    [junit] 'outputtoformatters=true'
    [junit] 'logfailedtests=true'
    [junit] 'logtestlistenerevents=false'
    [junit] 'formatter=org.apache.tools.ant.taskdefs.optional.junit.BriefJUnitResultFormatter'
    [junit] 'formatter=org.apache.tools.ant.taskdefs.optional.junit.XMLJUnitResultFormatter,c:\JogAmpSlavex32\workspace\jocl\label\win7-x86_32-amd\build\test\results\TEST-com.jogamp.opencl.CLProgramTest.xml'
    [junit] 'crashfile=c:\JogAmpSlavex32\workspace\jocl\label\win7-x86_32-amd\build\junitvmwatcher3384960188561519025.properties'
    [junit] 'propsfile=c:\JogAmpSlavex32\workspace\jocl\label\win7-x86_32-amd\build\junit8170368255466465998.properties'
    [junit] 
    [junit] The ' characters around the executable and arguments are
    [junit] not part of the command.
    [junit] Testsuite: com.jogamp.opencl.CLProgramTest
    [junit] #
    [junit] # A fatal error has been detected by the Java Runtime Environment:
    [junit] #
    [junit] #  EXCEPTION_ACCESS_VIOLATION (0xc0000005) at pc=0x77e8e3c6, pid=1948, tid=2008
    [junit] #
    [junit] # JRE version: Java(TM) SE Runtime Environment (7.0_45-b18) (build 1.7.0_45-b18)
    [junit] # Java VM: Java HotSpot(TM) Client VM (24.45-b08 mixed mode windows-x86 )
    [junit] # Problematic frame:
    [junit] # C  [ntdll.dll+0x2e3c6]
    [junit] #
    [junit] # Failed to write core dump. Minidumps are not enabled by default on client versions of Windows
    [junit] #
    [junit] # An error report file with more information is saved as:
    [junit] # c:\JogAmpSlavex32\workspace\jocl\label\win7-x86_32-amd\hs_err_pid1948.log
    [junit] #
    [junit] # If you would like to submit a bug report, please visit:
    [junit] #   http://bugreport.sun.com/bugreport/crash.jsp
    [junit] # The crash happened outside the Java Virtual Machine in native code.
    [junit] # See problematic frame for where to report the bug.
    [junit] #
    [junit] Using System properties {java.runtime.name=Java(TM) SE Runtime Environment, sun.boot.library.path=c:\jdk1.7.0_45_x32\jre\bin, java.vm.version=24.45-b08, ant.library.dir=C:\apache-ant-1.8.2\lib, java.vm.vendor=Oracle Corporation, java.vendor.url=http://java.oracle.com/, path.separator=;, java.vm.name=Java HotSpot(TM) Client VM, file.encoding.pkg=sun.io, user.country=US, user.script=, sun.java.launcher=SUN_STANDARD, sun.os.patch.level=, java.vm.specification.name=Java Virtual Machine Specification, user.dir=c:\JogAmpSlavex32\workspace\jocl\label\win7-x86_32-amd, java.runtime.version=1.7.0_45-b18, java.awt.graphicsenv=sun.awt.Win32GraphicsEnvironment, java.endorsed.dirs=c:\jdk1.7.0_45_x32\jre\lib\endorsed, os.arch=x86, java.io.tmpdir=C:\cygwin\tmp\, line.separator=
    [junit] , java.vm.specification.vendor=Oracle Corporation, user.variant=, os.name=Windows 7, ant.home=C:\apache-ant-1.8.2\bin\.., sun.jnu.encoding=Cp1252, java.library.path=c:\jdk1.7.0_45_x32\bin;C:\Windows\Sun\Java\bin;C:\Windows\system32;C:\Windows;c:\jdk1.7.0_45_x32\bin;C:\apache-ant-1.8.2\bin;c:\mingw\bin;C:\cygwin\bin;C:\Program Files\7-Zip;C:\cygwin\usr\local\bin;C:\cygwin\bin;C:\Program Files (x86)\AMD APP\bin\x86_64;C:\Program Files (x86)\AMD APP\bin\x86;C:\Users\jogamp-admin\Documents\ATI Stream\bin\x86_64;C:\Users\jogamp-admin\Documents\ATI Stream\bin\x86;C:\Windows\system32;C:\Windows;C:\Windows\System32\Wbem;C:\Windows\System32\WindowsPowerShell\v1.0;C:\Program Files (x86)\ATI Technologies\ATI.ACE\Core-Static;C:\Program Files (x86)\Common Files\Roxio Shared\DLLShared;C:\Program Files (x86)\Common Files\Roxio Shared\10.0\DLLShared;C:\cygwin\bin;C:\Program Files (x86)\ATI Stream\Tools\Stream KernelAnalyzer 1.6;C:\cygwin\lib\lapack;., java.specification.name=Java Platform API Specification, java.class.version=51.0, sun.management.compiler=HotSpot Client Compiler, os.version=6.1, user.home=C:\Users\jogamp, user.timezone=Europe/Athens, java.awt.printerjob=sun.awt.windows.WPrinterJob, file.encoding=Cp1252, java.specification.version=1.7, java.class.path=C:\apache-ant-1.8.2\bin\..\lib\ant-launcher.jar;C:\apache-ant-1.8.2\lib\ant-antlr.jar;C:\apache-ant-1.8.2\lib\ant-apache-bcel.jar;C:\apache-ant-1.8.2\lib\ant-apache-bsf.jar;C:\apache-ant-1.8.2\lib\ant-apache-log4j.jar;C:\apache-ant-1.8.2\lib\ant-apache-oro.jar;C:\apache-ant-1.8.2\lib\ant-apache-regexp.jar;C:\apache-ant-1.8.2\lib\ant-apache-resolver.jar;C:\apache-ant-1.8.2\lib\ant-apache-xalan2.jar;C:\apache-ant-1.8.2\lib\ant-commons-logging.jar;C:\apache-ant-1.8.2\lib\ant-commons-net.jar;C:\apache-ant-1.8.2\lib\ant-jai.jar;C:\apache-ant-1.8.2\lib\ant-javamail.jar;C:\apache-ant-1.8.2\lib\ant-jdepend.jar;C:\apache-ant-1.8.2\lib\ant-jmf.jar;C:\apache-ant-1.8.2\lib\ant-jsch.jar;C:\apache-ant-1.8.2\lib\ant-junit.jar;C:\apache-ant-1.8.2\lib\ant-junit4.jar;C:\apache-ant-1.8.2\lib\ant-launcher.jar;C:\apache-ant-1.8.2\lib\ant-netrexx.jar;C:\apache-ant-1.8.2\lib\ant-swing.jar;C:\apache-ant-1.8.2\lib\ant-testutil.jar;C:\apache-ant-1.8.2\lib\ant.jar;c:\jdk1.7.0_45_x32\lib\tools.jar, user.name=jogamp, java.vm.specification.version=1.7, sun.java.command=org.apache.tools.ant.launch.Launcher -Dlabel win7-x86_32-amd -Djocl.basename jocl -Djogl.basename jogl -Dgluegen.basename gluegen -Dgluegen.root ../../../gluegen/label/win7-x86_32-amd -Djocl.build.id 2013-11-01_20-56-20 -Djocl.build.number 873 -Djocl.build.commit cb27127c0be28cc1c864bcf5b6c94b860d3590d2 -Djogl.root ../../../jogl/label/win7-x86_32-amd -Djocl.build.branch origin/master -v clean-jar-test, java.home=c:\jdk1.7.0_45_x32\jre, sun.arch.data.model=32, user.language=en, java.specification.vendor=Oracle Corporation, awt.toolkit=sun.awt.windows.WToolkit, java.vm.info=mixed mode, java.version=1.7.0_45, java.ext.dirs=c:\jdk1.7.0_45_x32\jre\lib\ext;C:\Windows\Sun\Java\lib\ext, sun.boot.class.path=c:\jdk1.7.0_45_x32\jre\lib\resources.jar;c:\jdk1.7.0_45_x32\jre\lib\rt.jar;c:\jdk1.7.0_45_x32\jre\lib\sunrsasign.jar;c:\jdk1.7.0_45_x32\jre\lib\jsse.jar;c:\jdk1.7.0_45_x32\jre\lib\jce.jar;c:\jdk1.7.0_45_x32\jre\lib\charsets.jar;c:\jdk1.7.0_45_x32\jre\lib\jfr.jar;c:\jdk1.7.0_45_x32\jre\classes, java.vendor=Oracle Corporation, file.separator=\, java.vendor.url.bug=http://bugreport.sun.com/bugreport/, sun.io.unicode.encoding=UnicodeLittle, sun.cpu.endian=little, sun.desktop=windows, sun.cpu.isalist=pentium_pro+mmx pentium_pro pentium+mmx pentium i486 i386 i86}
    [junit] Testsuite: com.jogamp.opencl.CLProgramTest
    [junit] Tests run: 1, Failures: 0, Errors: 1, Time elapsed: 0 sec
    [junit] 
    [junit] Testcase: com.jogamp.opencl.CLProgramTest:kernelTest:	Caused an ERROR
    [junit] Forked Java VM exited abnormally. Please note the time in the report does not reflect the time until the VM exit.
    [junit] junit.framework.AssertionFailedError: Forked Java VM exited abnormally. Please note the time in the report does not reflect the time until the VM exit.
    [junit] 
    [junit] 
    [junit] Test com.jogamp.opencl.CLProgramTest FAILED (crashed)
Override ignored for property "tests.failed"
Override ignored for property "tests.failed"
    [junit] Implicitly adding C:\apache-ant-1.8.2\lib\ant-launcher.jar;C:\apache-ant-1.8.2\lib\ant.jar;C:\apache-ant-1.8.2\lib\ant-junit.jar;C:\apache-ant-1.8.2\lib\ant-junit4.jar to CLASSPATH
    [junit] Executing 'c:\jdk1.7.0_45_x32\jre\bin\java.exe' with arguments:
    [junit] '-Djnlp.no.jvm.data.model.set=true'
    [junit] '-Xmx256m'
    [junit] '-Djava.library.path=c:\JogAmpSlavex32\workspace\jocl\label\win7-x86_32-amd/build/natives/jocl;../../../jogl/label/win7-x86_32-amd/build/lib;../../../gluegen/label/win7-x86_32-amd/build/obj'
    [junit] '-classpath'
    [junit] 'c:\JogAmpSlavex32\workspace\jocl\label\win7-x86_32-amd\build\jar\jocl.jar;c:\JogAmpSlavex32\workspace\gluegen\label\win7-x86_32-amd\build\gluegen-rt.jar;c:\JogAmpSlavex32\workspace\jogl\label\win7-x86_32-amd\build\jar\jogl-all.jar;c:\JogAmpSlavex32\workspace\jocl\label\win7-x86_32-amd\build\classes;c:\JogAmpSlavex32\workspace\jocl\label\win7-x86_32-amd\lib\junit_4\junit-4.8.1.jar;c:\JogAmpSlavex32\workspace\jocl\label\win7-x86_32-amd\build\test\classes;C:\apache-ant-1.8.2\lib\ant-launcher.jar;C:\apache-ant-1.8.2\lib\ant.jar;C:\apache-ant-1.8.2\lib\ant-junit.jar;C:\apache-ant-1.8.2\lib\ant-junit4.jar'
    [junit] 'org.apache.tools.ant.taskdefs.optional.junit.JUnitTestRunner'
    [junit] 'com.jogamp.opencl.HighLevelBindingTest'
    [junit] 'filtertrace=true'
    [junit] 'haltOnError=false'
    [junit] 'haltOnFailure=false'
    [junit] 'showoutput=true'
    [junit] 'outputtoformatters=true'
    [junit] 'logfailedtests=true'
    [junit] 'logtestlistenerevents=false'
    [junit] 'formatter=org.apache.tools.ant.taskdefs.optional.junit.BriefJUnitResultFormatter'
    [junit] 'formatter=org.apache.tools.ant.taskdefs.optional.junit.XMLJUnitResultFormatter,c:\JogAmpSlavex32\workspace\jocl\label\win7-x86_32-amd\build\test\results\TEST-com.jogamp.opencl.HighLevelBindingTest.xml'
    [junit] 'crashfile=c:\JogAmpSlavex32\workspace\jocl\label\win7-x86_32-amd\build\junitvmwatcher2785694675567165576.properties'
    [junit] 'propsfile=c:\JogAmpSlavex32\workspace\jocl\label\win7-x86_32-amd\build\junit7996201108462916471.properties'
    [junit] 
    [junit] The ' characters around the executable and arguments are
    [junit] not part of the command.
    [junit] Testsuite: com.jogamp.opencl.HighLevelBindingTest
    [junit] OS: Windows 7
    [junit] ARCH: x86
    [junit] VM: Java HotSpot(TM) Client VM
    [junit] lib path: c:\JogAmpSlavex32\workspace\jocl\label\win7-x86_32-amd/build/natives/jocl;../../../jogl/label/win7-x86_32-amd/build/lib;../../../gluegen/label/win7-x86_32-amd/build/obj
    [junit] #
    [junit] # A fatal error has been detected by the Java Runtime Environment:
    [junit] #
    [junit] #  EXCEPTION_ACCESS_VIOLATION (0xc0000005) at pc=0x77e8e3c6, pid=4424, tid=2068
    [junit] #
    [junit] # JRE version: Java(TM) SE Runtime Environment (7.0_45-b18) (build 1.7.0_45-b18)
    [junit] # Java VM: Java HotSpot(TM) Client VM (24.45-b08 mixed mode windows-x86 )
    [junit] # Problematic frame:
    [junit] # C  [ntdll.dll+0x2e3c6]
    [junit] #
    [junit] # Failed to write core dump. Minidumps are not enabled by default on client versions of Windows
    [junit] #
    [junit] # An error report file with more information is saved as:
    [junit] # c:\JogAmpSlavex32\workspace\jocl\label\win7-x86_32-amd\hs_err_pid4424.log
    [junit] #
    [junit] # If you would like to submit a bug report, please visit:
    [junit] #   http://bugreport.sun.com/bugreport/crash.jsp
    [junit] # The crash happened outside the Java Virtual Machine in native code.
    [junit] # See problematic frame for where to report the bug.
    [junit] #
    [junit] Using System properties {java.runtime.name=Java(TM) SE Runtime Environment, sun.boot.library.path=c:\jdk1.7.0_45_x32\jre\bin, java.vm.version=24.45-b08, ant.library.dir=C:\apache-ant-1.8.2\lib, java.vm.vendor=Oracle Corporation, java.vendor.url=http://java.oracle.com/, path.separator=;, java.vm.name=Java HotSpot(TM) Client VM, file.encoding.pkg=sun.io, user.country=US, user.script=, sun.java.launcher=SUN_STANDARD, sun.os.patch.level=, java.vm.specification.name=Java Virtual Machine Specification, user.dir=c:\JogAmpSlavex32\workspace\jocl\label\win7-x86_32-amd, java.runtime.version=1.7.0_45-b18, java.awt.graphicsenv=sun.awt.Win32GraphicsEnvironment, java.endorsed.dirs=c:\jdk1.7.0_45_x32\jre\lib\endorsed, os.arch=x86, java.io.tmpdir=C:\cygwin\tmp\, line.separator=
    [junit] , java.vm.specification.vendor=Oracle Corporation, user.variant=, os.name=Windows 7, ant.home=C:\apache-ant-1.8.2\bin\.., sun.jnu.encoding=Cp1252, java.library.path=c:\jdk1.7.0_45_x32\bin;C:\Windows\Sun\Java\bin;C:\Windows\system32;C:\Windows;c:\jdk1.7.0_45_x32\bin;C:\apache-ant-1.8.2\bin;c:\mingw\bin;C:\cygwin\bin;C:\Program Files\7-Zip;C:\cygwin\usr\local\bin;C:\cygwin\bin;C:\Program Files (x86)\AMD APP\bin\x86_64;C:\Program Files (x86)\AMD APP\bin\x86;C:\Users\jogamp-admin\Documents\ATI Stream\bin\x86_64;C:\Users\jogamp-admin\Documents\ATI Stream\bin\x86;C:\Windows\system32;C:\Windows;C:\Windows\System32\Wbem;C:\Windows\System32\WindowsPowerShell\v1.0;C:\Program Files (x86)\ATI Technologies\ATI.ACE\Core-Static;C:\Program Files (x86)\Common Files\Roxio Shared\DLLShared;C:\Program Files (x86)\Common Files\Roxio Shared\10.0\DLLShared;C:\cygwin\bin;C:\Program Files (x86)\ATI Stream\Tools\Stream KernelAnalyzer 1.6;C:\cygwin\lib\lapack;., java.specification.name=Java Platform API Specification, java.class.version=51.0, sun.management.compiler=HotSpot Client Compiler, os.version=6.1, user.home=C:\Users\jogamp, user.timezone=Europe/Athens, java.awt.printerjob=sun.awt.windows.WPrinterJob, file.encoding=Cp1252, java.specification.version=1.7, java.class.path=C:\apache-ant-1.8.2\bin\..\lib\ant-launcher.jar;C:\apache-ant-1.8.2\lib\ant-antlr.jar;C:\apache-ant-1.8.2\lib\ant-apache-bcel.jar;C:\apache-ant-1.8.2\lib\ant-apache-bsf.jar;C:\apache-ant-1.8.2\lib\ant-apache-log4j.jar;C:\apache-ant-1.8.2\lib\ant-apache-oro.jar;C:\apache-ant-1.8.2\lib\ant-apache-regexp.jar;C:\apache-ant-1.8.2\lib\ant-apache-resolver.jar;C:\apache-ant-1.8.2\lib\ant-apache-xalan2.jar;C:\apache-ant-1.8.2\lib\ant-commons-logging.jar;C:\apache-ant-1.8.2\lib\ant-commons-net.jar;C:\apache-ant-1.8.2\lib\ant-jai.jar;C:\apache-ant-1.8.2\lib\ant-javamail.jar;C:\apache-ant-1.8.2\lib\ant-jdepend.jar;C:\apache-ant-1.8.2\lib\ant-jmf.jar;C:\apache-ant-1.8.2\lib\ant-jsch.jar;C:\apache-ant-1.8.2\lib\ant-junit.jar;C:\apache-ant-1.8.2\lib\ant-junit4.jar;C:\apache-ant-1.8.2\lib\ant-launcher.jar;C:\apache-ant-1.8.2\lib\ant-netrexx.jar;C:\apache-ant-1.8.2\lib\ant-swing.jar;C:\apache-ant-1.8.2\lib\ant-testutil.jar;C:\apache-ant-1.8.2\lib\ant.jar;c:\jdk1.7.0_45_x32\lib\tools.jar, user.name=jogamp, java.vm.specification.version=1.7, sun.java.command=org.apache.tools.ant.launch.Launcher -Dlabel win7-x86_32-amd -Djocl.basename jocl -Djogl.basename jogl -Dgluegen.basename gluegen -Dgluegen.root ../../../gluegen/label/win7-x86_32-amd -Djocl.build.id 2013-11-01_20-56-20 -Djocl.build.number 873 -Djocl.build.commit cb27127c0be28cc1c864bcf5b6c94b860d3590d2 -Djogl.root ../../../jogl/label/win7-x86_32-amd -Djocl.build.branch origin/master -v clean-jar-test, java.home=c:\jdk1.7.0_45_x32\jre, sun.arch.data.model=32, user.language=en, java.specification.vendor=Oracle Corporation, awt.toolkit=sun.awt.windows.WToolkit, java.vm.info=mixed mode, java.version=1.7.0_45, java.ext.dirs=c:\jdk1.7.0_45_x32\jre\lib\ext;C:\Windows\Sun\Java\lib\ext, sun.boot.class.path=c:\jdk1.7.0_45_x32\jre\lib\resources.jar;c:\jdk1.7.0_45_x32\jre\lib\rt.jar;c:\jdk1.7.0_45_x32\jre\lib\sunrsasign.jar;c:\jdk1.7.0_45_x32\jre\lib\jsse.jar;c:\jdk1.7.0_45_x32\jre\lib\jce.jar;c:\jdk1.7.0_45_x32\jre\lib\charsets.jar;c:\jdk1.7.0_45_x32\jre\lib\jfr.jar;c:\jdk1.7.0_45_x32\jre\classes, java.vendor=Oracle Corporation, file.separator=\, java.vendor.url.bug=http://bugreport.sun.com/bugreport/, sun.io.unicode.encoding=UnicodeLittle, sun.cpu.endian=little, sun.desktop=windows, sun.cpu.isalist=pentium_pro+mmx pentium_pro pentium+mmx pentium i486 i386 i86}
    [junit] Testsuite: com.jogamp.opencl.HighLevelBindingTest
    [junit] Tests run: 1, Failures: 0, Errors: 1, Time elapsed: 0 sec
    [junit] 
    [junit] Testcase: com.jogamp.opencl.HighLevelBindingTest:platformTest:	Caused an ERROR
    [junit] Forked Java VM exited abnormally. Please note the time in the report does not reflect the time until the VM exit.
    [junit] junit.framework.AssertionFailedError: Forked Java VM exited abnormally. Please note the time in the report does not reflect the time until the VM exit.
    [junit] 
    [junit] 
    [junit] Test com.jogamp.opencl.HighLevelBindingTest FAILED (crashed)
Override ignored for property "tests.failed"
Override ignored for property "tests.failed"
    [junit] Implicitly adding C:\apache-ant-1.8.2\lib\ant-launcher.jar;C:\apache-ant-1.8.2\lib\ant.jar;C:\apache-ant-1.8.2\lib\ant-junit.jar;C:\apache-ant-1.8.2\lib\ant-junit4.jar to CLASSPATH
    [junit] Executing 'c:\jdk1.7.0_45_x32\jre\bin\java.exe' with arguments:
    [junit] '-Djnlp.no.jvm.data.model.set=true'
    [junit] '-Xmx256m'
    [junit] '-Djava.library.path=c:\JogAmpSlavex32\workspace\jocl\label\win7-x86_32-amd/build/natives/jocl;../../../jogl/label/win7-x86_32-amd/build/lib;../../../gluegen/label/win7-x86_32-amd/build/obj'
    [junit] '-classpath'
    [junit] 'c:\JogAmpSlavex32\workspace\jocl\label\win7-x86_32-amd\build\jar\jocl.jar;c:\JogAmpSlavex32\workspace\gluegen\label\win7-x86_32-amd\build\gluegen-rt.jar;c:\JogAmpSlavex32\workspace\jogl\label\win7-x86_32-amd\build\jar\jogl-all.jar;c:\JogAmpSlavex32\workspace\jocl\label\win7-x86_32-amd\build\classes;c:\JogAmpSlavex32\workspace\jocl\label\win7-x86_32-amd\lib\junit_4\junit-4.8.1.jar;c:\JogAmpSlavex32\workspace\jocl\label\win7-x86_32-amd\build\test\classes;C:\apache-ant-1.8.2\lib\ant-launcher.jar;C:\apache-ant-1.8.2\lib\ant.jar;C:\apache-ant-1.8.2\lib\ant-junit.jar;C:\apache-ant-1.8.2\lib\ant-junit4.jar'
    [junit] 'org.apache.tools.ant.taskdefs.optional.junit.JUnitTestRunner'
    [junit] 'com.jogamp.opencl.LowLevelBindingTest'
    [junit] 'filtertrace=true'
    [junit] 'haltOnError=false'
    [junit] 'haltOnFailure=false'
    [junit] 'showoutput=true'
    [junit] 'outputtoformatters=true'
    [junit] 'logfailedtests=true'
    [junit] 'logtestlistenerevents=false'
    [junit] 'formatter=org.apache.tools.ant.taskdefs.optional.junit.BriefJUnitResultFormatter'
    [junit] 'formatter=org.apache.tools.ant.taskdefs.optional.junit.XMLJUnitResultFormatter,c:\JogAmpSlavex32\workspace\jocl\label\win7-x86_32-amd\build\test\results\TEST-com.jogamp.opencl.LowLevelBindingTest.xml'
    [junit] 'crashfile=c:\JogAmpSlavex32\workspace\jocl\label\win7-x86_32-amd\build\junitvmwatcher4486777741029139802.properties'
    [junit] 'propsfile=c:\JogAmpSlavex32\workspace\jocl\label\win7-x86_32-amd\build\junit6612572814742553061.properties'
    [junit] 
    [junit] The ' characters around the executable and arguments are
    [junit] not part of the command.
    [junit] Testsuite: com.jogamp.opencl.LowLevelBindingTest
    [junit] OS: Windows 7
    [junit] VM: Java HotSpot(TM) Client VM
    [junit]  - - - lowLevelTest2; VectorAdd kernel - - - 
    [junit] #
    [junit] # A fatal error has been detected by the Java Runtime Environment:
    [junit] #
    [junit] #  EXCEPTION_ACCESS_VIOLATION (0xc0000005) at pc=0x77e8e3c6, pid=5068, tid=4816
    [junit] #
    [junit] # JRE version: Java(TM) SE Runtime Environment (7.0_45-b18) (build 1.7.0_45-b18)
    [junit] # Java VM: Java HotSpot(TM) Client VM (24.45-b08 mixed mode windows-x86 )
    [junit] # Problematic frame:
    [junit] # C  [ntdll.dll+0x2e3c6]
    [junit] #
    [junit] # Failed to write core dump. Minidumps are not enabled by default on client versions of Windows
    [junit] #
    [junit] # An error report file with more information is saved as:
    [junit] # c:\JogAmpSlavex32\workspace\jocl\label\win7-x86_32-amd\hs_err_pid5068.log
    [junit] #
    [junit] # If you would like to submit a bug report, please visit:
    [junit] #   http://bugreport.sun.com/bugreport/crash.jsp
    [junit] # The crash happened outside the Java Virtual Machine in native code.
    [junit] # See problematic frame for where to report the bug.
    [junit] #
    [junit] Using System properties {java.runtime.name=Java(TM) SE Runtime Environment, sun.boot.library.path=c:\jdk1.7.0_45_x32\jre\bin, java.vm.version=24.45-b08, ant.library.dir=C:\apache-ant-1.8.2\lib, java.vm.vendor=Oracle Corporation, java.vendor.url=http://java.oracle.com/, path.separator=;, java.vm.name=Java HotSpot(TM) Client VM, file.encoding.pkg=sun.io, user.country=US, user.script=, sun.java.launcher=SUN_STANDARD, sun.os.patch.level=, java.vm.specification.name=Java Virtual Machine Specification, user.dir=c:\JogAmpSlavex32\workspace\jocl\label\win7-x86_32-amd, java.runtime.version=1.7.0_45-b18, java.awt.graphicsenv=sun.awt.Win32GraphicsEnvironment, java.endorsed.dirs=c:\jdk1.7.0_45_x32\jre\lib\endorsed, os.arch=x86, java.io.tmpdir=C:\cygwin\tmp\, line.separator=
    [junit] , java.vm.specification.vendor=Oracle Corporation, user.variant=, os.name=Windows 7, ant.home=C:\apache-ant-1.8.2\bin\.., sun.jnu.encoding=Cp1252, java.library.path=c:\jdk1.7.0_45_x32\bin;C:\Windows\Sun\Java\bin;C:\Windows\system32;C:\Windows;c:\jdk1.7.0_45_x32\bin;C:\apache-ant-1.8.2\bin;c:\mingw\bin;C:\cygwin\bin;C:\Program Files\7-Zip;C:\cygwin\usr\local\bin;C:\cygwin\bin;C:\Program Files (x86)\AMD APP\bin\x86_64;C:\Program Files (x86)\AMD APP\bin\x86;C:\Users\jogamp-admin\Documents\ATI Stream\bin\x86_64;C:\Users\jogamp-admin\Documents\ATI Stream\bin\x86;C:\Windows\system32;C:\Windows;C:\Windows\System32\Wbem;C:\Windows\System32\WindowsPowerShell\v1.0;C:\Program Files (x86)\ATI Technologies\ATI.ACE\Core-Static;C:\Program Files (x86)\Common Files\Roxio Shared\DLLShared;C:\Program Files (x86)\Common Files\Roxio Shared\10.0\DLLShared;C:\cygwin\bin;C:\Program Files (x86)\ATI Stream\Tools\Stream KernelAnalyzer 1.6;C:\cygwin\lib\lapack;., java.specification.name=Java Platform API Specification, java.class.version=51.0, sun.management.compiler=HotSpot Client Compiler, os.version=6.1, user.home=C:\Users\jogamp, user.timezone=Europe/Athens, java.awt.printerjob=sun.awt.windows.WPrinterJob, file.encoding=Cp1252, java.specification.version=1.7, java.class.path=C:\apache-ant-1.8.2\bin\..\lib\ant-launcher.jar;C:\apache-ant-1.8.2\lib\ant-antlr.jar;C:\apache-ant-1.8.2\lib\ant-apache-bcel.jar;C:\apache-ant-1.8.2\lib\ant-apache-bsf.jar;C:\apache-ant-1.8.2\lib\ant-apache-log4j.jar;C:\apache-ant-1.8.2\lib\ant-apache-oro.jar;C:\apache-ant-1.8.2\lib\ant-apache-regexp.jar;C:\apache-ant-1.8.2\lib\ant-apache-resolver.jar;C:\apache-ant-1.8.2\lib\ant-apache-xalan2.jar;C:\apache-ant-1.8.2\lib\ant-commons-logging.jar;C:\apache-ant-1.8.2\lib\ant-commons-net.jar;C:\apache-ant-1.8.2\lib\ant-jai.jar;C:\apache-ant-1.8.2\lib\ant-javamail.jar;C:\apache-ant-1.8.2\lib\ant-jdepend.jar;C:\apache-ant-1.8.2\lib\ant-jmf.jar;C:\apache-ant-1.8.2\lib\ant-jsch.jar;C:\apache-ant-1.8.2\lib\ant-junit.jar;C:\apache-ant-1.8.2\lib\ant-junit4.jar;C:\apache-ant-1.8.2\lib\ant-launcher.jar;C:\apache-ant-1.8.2\lib\ant-netrexx.jar;C:\apache-ant-1.8.2\lib\ant-swing.jar;C:\apache-ant-1.8.2\lib\ant-testutil.jar;C:\apache-ant-1.8.2\lib\ant.jar;c:\jdk1.7.0_45_x32\lib\tools.jar, user.name=jogamp, java.vm.specification.version=1.7, sun.java.command=org.apache.tools.ant.launch.Launcher -Dlabel win7-x86_32-amd -Djocl.basename jocl -Djogl.basename jogl -Dgluegen.basename gluegen -Dgluegen.root ../../../gluegen/label/win7-x86_32-amd -Djocl.build.id 2013-11-01_20-56-20 -Djocl.build.number 873 -Djocl.build.commit cb27127c0be28cc1c864bcf5b6c94b860d3590d2 -Djogl.root ../../../jogl/label/win7-x86_32-amd -Djocl.build.branch origin/master -v clean-jar-test, java.home=c:\jdk1.7.0_45_x32\jre, sun.arch.data.model=32, user.language=en, java.specification.vendor=Oracle Corporation, awt.toolkit=sun.awt.windows.WToolkit, java.vm.info=mixed mode, java.version=1.7.0_45, java.ext.dirs=c:\jdk1.7.0_45_x32\jre\lib\ext;C:\Windows\Sun\Java\lib\ext, sun.boot.class.path=c:\jdk1.7.0_45_x32\jre\lib\resources.jar;c:\jdk1.7.0_45_x32\jre\lib\rt.jar;c:\jdk1.7.0_45_x32\jre\lib\sunrsasign.jar;c:\jdk1.7.0_45_x32\jre\lib\jsse.jar;c:\jdk1.7.0_45_x32\jre\lib\jce.jar;c:\jdk1.7.0_45_x32\jre\lib\charsets.jar;c:\jdk1.7.0_45_x32\jre\lib\jfr.jar;c:\jdk1.7.0_45_x32\jre\classes, java.vendor=Oracle Corporation, file.separator=\, java.vendor.url.bug=http://bugreport.sun.com/bugreport/, sun.io.unicode.encoding=UnicodeLittle, sun.cpu.endian=little, sun.desktop=windows, sun.cpu.isalist=pentium_pro+mmx pentium_pro pentium+mmx pentium i486 i386 i86}
    [junit] Testsuite: com.jogamp.opencl.LowLevelBindingTest
    [junit] Tests run: 1, Failures: 0, Errors: 1, Time elapsed: 0 sec
    [junit] 
    [junit] Testcase: com.jogamp.opencl.LowLevelBindingTest:lowLevelVectorAddTest:	Caused an ERROR
    [junit] Forked Java VM exited abnormally. Please note the time in the report does not reflect the time until the VM exit.
    [junit] junit.framework.AssertionFailedError: Forked Java VM exited abnormally. Please note the time in the report does not reflect the time until the VM exit.
    [junit] 
    [junit] 
    [junit] Test com.jogamp.opencl.LowLevelBindingTest FAILED (crashed)
Override ignored for property "tests.failed"
Override ignored for property "tests.failed"
    [junit] Implicitly adding C:\apache-ant-1.8.2\lib\ant-launcher.jar;C:\apache-ant-1.8.2\lib\ant.jar;C:\apache-ant-1.8.2\lib\ant-junit.jar;C:\apache-ant-1.8.2\lib\ant-junit4.jar to CLASSPATH
    [junit] Executing 'c:\jdk1.7.0_45_x32\jre\bin\java.exe' with arguments:
    [junit] '-Djnlp.no.jvm.data.model.set=true'
    [junit] '-Xmx256m'
    [junit] '-Djava.library.path=c:\JogAmpSlavex32\workspace\jocl\label\win7-x86_32-amd/build/natives/jocl;../../../jogl/label/win7-x86_32-amd/build/lib;../../../gluegen/label/win7-x86_32-amd/build/obj'
    [junit] '-classpath'
    [junit] 'c:\JogAmpSlavex32\workspace\jocl\label\win7-x86_32-amd\build\jar\jocl.jar;c:\JogAmpSlavex32\workspace\gluegen\label\win7-x86_32-amd\build\gluegen-rt.jar;c:\JogAmpSlavex32\workspace\jogl\label\win7-x86_32-amd\build\jar\jogl-all.jar;c:\JogAmpSlavex32\workspace\jocl\label\win7-x86_32-amd\build\classes;c:\JogAmpSlavex32\workspace\jocl\label\win7-x86_32-amd\lib\junit_4\junit-4.8.1.jar;c:\JogAmpSlavex32\workspace\jocl\label\win7-x86_32-amd\build\test\classes;C:\apache-ant-1.8.2\lib\ant-launcher.jar;C:\apache-ant-1.8.2\lib\ant.jar;C:\apache-ant-1.8.2\lib\ant-junit.jar;C:\apache-ant-1.8.2\lib\ant-junit4.jar'
    [junit] 'org.apache.tools.ant.taskdefs.optional.junit.JUnitTestRunner'
    [junit] 'com.jogamp.opencl.gl.CLGLTest'
    [junit] 'filtertrace=true'
    [junit] 'haltOnError=false'
    [junit] 'haltOnFailure=false'
    [junit] 'showoutput=true'
    [junit] 'outputtoformatters=true'
    [junit] 'logfailedtests=true'
    [junit] 'logtestlistenerevents=false'
    [junit] 'formatter=org.apache.tools.ant.taskdefs.optional.junit.BriefJUnitResultFormatter'
    [junit] 'formatter=org.apache.tools.ant.taskdefs.optional.junit.XMLJUnitResultFormatter,c:\JogAmpSlavex32\workspace\jocl\label\win7-x86_32-amd\build\test\results\TEST-com.jogamp.opencl.gl.CLGLTest.xml'
    [junit] 'crashfile=c:\JogAmpSlavex32\workspace\jocl\label\win7-x86_32-amd\build\junitvmwatcher4167114656204107506.properties'
    [junit] 'propsfile=c:\JogAmpSlavex32\workspace\jocl\label\win7-x86_32-amd\build\junit5944487486717000904.properties'
    [junit] 
    [junit] The ' characters around the executable and arguments are
    [junit] not part of the command.
    [junit] Testsuite: com.jogamp.opencl.gl.CLGLTest
    [junit]  - - - glcl; vboSharing - - - 
    [junit] #
    [junit] # A fatal error has been detected by the Java Runtime Environment:
    [junit] #
    [junit] #  EXCEPTION_ACCESS_VIOLATION (0xc0000005) at pc=0x77e8e3c6, pid=2704, tid=3564
    [junit] #
    [junit] # JRE version: Java(TM) SE Runtime Environment (7.0_45-b18) (build 1.7.0_45-b18)
    [junit] # Java VM: Java HotSpot(TM) Client VM (24.45-b08 mixed mode windows-x86 )
    [junit] # Problematic frame:
    [junit] # C  [ntdll.dll+0x2e3c6]
    [junit] #
    [junit] # Failed to write core dump. Minidumps are not enabled by default on client versions of Windows
    [junit] #
    [junit] # An error report file with more information is saved as:
    [junit] # c:\JogAmpSlavex32\workspace\jocl\label\win7-x86_32-amd\hs_err_pid2704.log
    [junit] #
    [junit] # If you would like to submit a bug report, please visit:
    [junit] #   http://bugreport.sun.com/bugreport/crash.jsp
    [junit] # The crash happened outside the Java Virtual Machine in native code.
    [junit] # See problematic frame for where to report the bug.
    [junit] #
    [junit] Using System properties {java.runtime.name=Java(TM) SE Runtime Environment, sun.boot.library.path=c:\jdk1.7.0_45_x32\jre\bin, java.vm.version=24.45-b08, ant.library.dir=C:\apache-ant-1.8.2\lib, java.vm.vendor=Oracle Corporation, java.vendor.url=http://java.oracle.com/, path.separator=;, java.vm.name=Java HotSpot(TM) Client VM, file.encoding.pkg=sun.io, user.country=US, user.script=, sun.java.launcher=SUN_STANDARD, sun.os.patch.level=, java.vm.specification.name=Java Virtual Machine Specification, user.dir=c:\JogAmpSlavex32\workspace\jocl\label\win7-x86_32-amd, java.runtime.version=1.7.0_45-b18, java.awt.graphicsenv=sun.awt.Win32GraphicsEnvironment, java.endorsed.dirs=c:\jdk1.7.0_45_x32\jre\lib\endorsed, os.arch=x86, java.io.tmpdir=C:\cygwin\tmp\, line.separator=
    [junit] , java.vm.specification.vendor=Oracle Corporation, user.variant=, os.name=Windows 7, ant.home=C:\apache-ant-1.8.2\bin\.., sun.jnu.encoding=Cp1252, java.library.path=c:\jdk1.7.0_45_x32\bin;C:\Windows\Sun\Java\bin;C:\Windows\system32;C:\Windows;c:\jdk1.7.0_45_x32\bin;C:\apache-ant-1.8.2\bin;c:\mingw\bin;C:\cygwin\bin;C:\Program Files\7-Zip;C:\cygwin\usr\local\bin;C:\cygwin\bin;C:\Program Files (x86)\AMD APP\bin\x86_64;C:\Program Files (x86)\AMD APP\bin\x86;C:\Users\jogamp-admin\Documents\ATI Stream\bin\x86_64;C:\Users\jogamp-admin\Documents\ATI Stream\bin\x86;C:\Windows\system32;C:\Windows;C:\Windows\System32\Wbem;C:\Windows\System32\WindowsPowerShell\v1.0;C:\Program Files (x86)\ATI Technologies\ATI.ACE\Core-Static;C:\Program Files (x86)\Common Files\Roxio Shared\DLLShared;C:\Program Files (x86)\Common Files\Roxio Shared\10.0\DLLShared;C:\cygwin\bin;C:\Program Files (x86)\ATI Stream\Tools\Stream KernelAnalyzer 1.6;C:\cygwin\lib\lapack;., java.specification.name=Java Platform API Specification, java.class.version=51.0, sun.management.compiler=HotSpot Client Compiler, os.version=6.1, user.home=C:\Users\jogamp, user.timezone=Europe/Athens, java.awt.printerjob=sun.awt.windows.WPrinterJob, file.encoding=Cp1252, java.specification.version=1.7, java.class.path=C:\apache-ant-1.8.2\bin\..\lib\ant-launcher.jar;C:\apache-ant-1.8.2\lib\ant-antlr.jar;C:\apache-ant-1.8.2\lib\ant-apache-bcel.jar;C:\apache-ant-1.8.2\lib\ant-apache-bsf.jar;C:\apache-ant-1.8.2\lib\ant-apache-log4j.jar;C:\apache-ant-1.8.2\lib\ant-apache-oro.jar;C:\apache-ant-1.8.2\lib\ant-apache-regexp.jar;C:\apache-ant-1.8.2\lib\ant-apache-resolver.jar;C:\apache-ant-1.8.2\lib\ant-apache-xalan2.jar;C:\apache-ant-1.8.2\lib\ant-commons-logging.jar;C:\apache-ant-1.8.2\lib\ant-commons-net.jar;C:\apache-ant-1.8.2\lib\ant-jai.jar;C:\apache-ant-1.8.2\lib\ant-javamail.jar;C:\apache-ant-1.8.2\lib\ant-jdepend.jar;C:\apache-ant-1.8.2\lib\ant-jmf.jar;C:\apache-ant-1.8.2\lib\ant-jsch.jar;C:\apache-ant-1.8.2\lib\ant-junit.jar;C:\apache-ant-1.8.2\lib\ant-junit4.jar;C:\apache-ant-1.8.2\lib\ant-launcher.jar;C:\apache-ant-1.8.2\lib\ant-netrexx.jar;C:\apache-ant-1.8.2\lib\ant-swing.jar;C:\apache-ant-1.8.2\lib\ant-testutil.jar;C:\apache-ant-1.8.2\lib\ant.jar;c:\jdk1.7.0_45_x32\lib\tools.jar, user.name=jogamp, java.vm.specification.version=1.7, sun.java.command=org.apache.tools.ant.launch.Launcher -Dlabel win7-x86_32-amd -Djocl.basename jocl -Djogl.basename jogl -Dgluegen.basename gluegen -Dgluegen.root ../../../gluegen/label/win7-x86_32-amd -Djocl.build.id 2013-11-01_20-56-20 -Djocl.build.number 873 -Djocl.build.commit cb27127c0be28cc1c864bcf5b6c94b860d3590d2 -Djogl.root ../../../jogl/label/win7-x86_32-amd -Djocl.build.branch origin/master -v clean-jar-test, java.home=c:\jdk1.7.0_45_x32\jre, sun.arch.data.model=32, user.language=en, java.specification.vendor=Oracle Corporation, awt.toolkit=sun.awt.windows.WToolkit, java.vm.info=mixed mode, java.version=1.7.0_45, java.ext.dirs=c:\jdk1.7.0_45_x32\jre\lib\ext;C:\Windows\Sun\Java\lib\ext, sun.boot.class.path=c:\jdk1.7.0_45_x32\jre\lib\resources.jar;c:\jdk1.7.0_45_x32\jre\lib\rt.jar;c:\jdk1.7.0_45_x32\jre\lib\sunrsasign.jar;c:\jdk1.7.0_45_x32\jre\lib\jsse.jar;c:\jdk1.7.0_45_x32\jre\lib\jce.jar;c:\jdk1.7.0_45_x32\jre\lib\charsets.jar;c:\jdk1.7.0_45_x32\jre\lib\jfr.jar;c:\jdk1.7.0_45_x32\jre\classes, java.vendor=Oracle Corporation, file.separator=\, java.vendor.url.bug=http://bugreport.sun.com/bugreport/, sun.io.unicode.encoding=UnicodeLittle, sun.cpu.endian=little, sun.desktop=windows, sun.cpu.isalist=pentium_pro+mmx pentium_pro pentium+mmx pentium i486 i386 i86}
    [junit] Testsuite: com.jogamp.opencl.gl.CLGLTest
    [junit] Tests run: 1, Failures: 0, Errors: 1, Time elapsed: 0 sec
    [junit] 
    [junit] Testcase: com.jogamp.opencl.gl.CLGLTest:vboSharing:	Caused an ERROR
    [junit] Forked Java VM exited abnormally. Please note the time in the report does not reflect the time until the VM exit.
    [junit] junit.framework.AssertionFailedError: Forked Java VM exited abnormally. Please note the time in the report does not reflect the time until the VM exit.
    [junit] 
    [junit] 
    [junit] Test com.jogamp.opencl.gl.CLGLTest FAILED (crashed)
Override ignored for property "tests.failed"
Override ignored for property "tests.failed"
    [junit] Implicitly adding C:\apache-ant-1.8.2\lib\ant-launcher.jar;C:\apache-ant-1.8.2\lib\ant.jar;C:\apache-ant-1.8.2\lib\ant-junit.jar;C:\apache-ant-1.8.2\lib\ant-junit4.jar to CLASSPATH
    [junit] Executing 'c:\jdk1.7.0_45_x32\jre\bin\java.exe' with arguments:
    [junit] '-Djnlp.no.jvm.data.model.set=true'
    [junit] '-Xmx256m'
    [junit] '-Djava.library.path=c:\JogAmpSlavex32\workspace\jocl\label\win7-x86_32-amd/build/natives/jocl;../../../jogl/label/win7-x86_32-amd/build/lib;../../../gluegen/label/win7-x86_32-amd/build/obj'
    [junit] '-classpath'
    [junit] 'c:\JogAmpSlavex32\workspace\jocl\label\win7-x86_32-amd\build\jar\jocl.jar;c:\JogAmpSlavex32\workspace\gluegen\label\win7-x86_32-amd\build\gluegen-rt.jar;c:\JogAmpSlavex32\workspace\jogl\label\win7-x86_32-amd\build\jar\jogl-all.jar;c:\JogAmpSlavex32\workspace\jocl\label\win7-x86_32-amd\build\classes;c:\JogAmpSlavex32\workspace\jocl\label\win7-x86_32-amd\lib\junit_4\junit-4.8.1.jar;c:\JogAmpSlavex32\workspace\jocl\label\win7-x86_32-amd\build\test\classes;C:\apache-ant-1.8.2\lib\ant-launcher.jar;C:\apache-ant-1.8.2\lib\ant.jar;C:\apache-ant-1.8.2\lib\ant-junit.jar;C:\apache-ant-1.8.2\lib\ant-junit4.jar'
    [junit] 'org.apache.tools.ant.taskdefs.optional.junit.JUnitTestRunner'
    [junit] 'com.jogamp.opencl.util.concurrent.CLMultiContextTest'
    [junit] 'filtertrace=true'
    [junit] 'haltOnError=false'
    [junit] 'haltOnFailure=false'
    [junit] 'showoutput=true'
    [junit] 'outputtoformatters=true'
    [junit] 'logfailedtests=true'
    [junit] 'logtestlistenerevents=false'
    [junit] 'formatter=org.apache.tools.ant.taskdefs.optional.junit.BriefJUnitResultFormatter'
    [junit] 'formatter=org.apache.tools.ant.taskdefs.optional.junit.XMLJUnitResultFormatter,c:\JogAmpSlavex32\workspace\jocl\label\win7-x86_32-amd\build\test\results\TEST-com.jogamp.opencl.util.concurrent.CLMultiContextTest.xml'
    [junit] 'crashfile=c:\JogAmpSlavex32\workspace\jocl\label\win7-x86_32-amd\build\junitvmwatcher5191026732829132488.properties'
    [junit] 'propsfile=c:\JogAmpSlavex32\workspace\jocl\label\win7-x86_32-amd\build\junit7865011023681626698.properties'
    [junit] 
    [junit] The ' characters around the executable and arguments are
    [junit] not part of the command.
    [junit] Testsuite: com.jogamp.opencl.util.concurrent.CLMultiContextTest
    [junit] #
    [junit] # A fatal error has been detected by the Java Runtime Environment:
    [junit] #
    [junit] #  EXCEPTION_ACCESS_VIOLATION (0xc0000005) at pc=0x77e8e3c6, pid=4656, tid=4664
    [junit] #
    [junit] # JRE version: Java(TM) SE Runtime Environment (7.0_45-b18) (build 1.7.0_45-b18)
    [junit] # Java VM: Java HotSpot(TM) Client VM (24.45-b08 mixed mode windows-x86 )
    [junit] # Problematic frame:
    [junit] # C  [ntdll.dll+0x2e3c6]
    [junit] #
    [junit] # Failed to write core dump. Minidumps are not enabled by default on client versions of Windows
    [junit] #
    [junit] # An error report file with more information is saved as:
    [junit] # c:\JogAmpSlavex32\workspace\jocl\label\win7-x86_32-amd\hs_err_pid4656.log
    [junit] #
    [junit] # If you would like to submit a bug report, please visit:
    [junit] #   http://bugreport.sun.com/bugreport/crash.jsp
    [junit] # The crash happened outside the Java Virtual Machine in native code.
    [junit] # See problematic frame for where to report the bug.
    [junit] #
    [junit] Using System properties {java.runtime.name=Java(TM) SE Runtime Environment, sun.boot.library.path=c:\jdk1.7.0_45_x32\jre\bin, java.vm.version=24.45-b08, ant.library.dir=C:\apache-ant-1.8.2\lib, java.vm.vendor=Oracle Corporation, java.vendor.url=http://java.oracle.com/, path.separator=;, java.vm.name=Java HotSpot(TM) Client VM, file.encoding.pkg=sun.io, user.country=US, user.script=, sun.java.launcher=SUN_STANDARD, sun.os.patch.level=, java.vm.specification.name=Java Virtual Machine Specification, user.dir=c:\JogAmpSlavex32\workspace\jocl\label\win7-x86_32-amd, java.runtime.version=1.7.0_45-b18, java.awt.graphicsenv=sun.awt.Win32GraphicsEnvironment, java.endorsed.dirs=c:\jdk1.7.0_45_x32\jre\lib\endorsed, os.arch=x86, java.io.tmpdir=C:\cygwin\tmp\, line.separator=
    [junit] , java.vm.specification.vendor=Oracle Corporation, user.variant=, os.name=Windows 7, ant.home=C:\apache-ant-1.8.2\bin\.., sun.jnu.encoding=Cp1252, java.library.path=c:\jdk1.7.0_45_x32\bin;C:\Windows\Sun\Java\bin;C:\Windows\system32;C:\Windows;c:\jdk1.7.0_45_x32\bin;C:\apache-ant-1.8.2\bin;c:\mingw\bin;C:\cygwin\bin;C:\Program Files\7-Zip;C:\cygwin\usr\local\bin;C:\cygwin\bin;C:\Program Files (x86)\AMD APP\bin\x86_64;C:\Program Files (x86)\AMD APP\bin\x86;C:\Users\jogamp-admin\Documents\ATI Stream\bin\x86_64;C:\Users\jogamp-admin\Documents\ATI Stream\bin\x86;C:\Windows\system32;C:\Windows;C:\Windows\System32\Wbem;C:\Windows\System32\WindowsPowerShell\v1.0;C:\Program Files (x86)\ATI Technologies\ATI.ACE\Core-Static;C:\Program Files (x86)\Common Files\Roxio Shared\DLLShared;C:\Program Files (x86)\Common Files\Roxio Shared\10.0\DLLShared;C:\cygwin\bin;C:\Program Files (x86)\ATI Stream\Tools\Stream KernelAnalyzer 1.6;C:\cygwin\lib\lapack;., java.specification.name=Java Platform API Specification, java.class.version=51.0, sun.management.compiler=HotSpot Client Compiler, os.version=6.1, user.home=C:\Users\jogamp, user.timezone=Europe/Athens, java.awt.printerjob=sun.awt.windows.WPrinterJob, file.encoding=Cp1252, java.specification.version=1.7, java.class.path=C:\apache-ant-1.8.2\bin\..\lib\ant-launcher.jar;C:\apache-ant-1.8.2\lib\ant-antlr.jar;C:\apache-ant-1.8.2\lib\ant-apache-bcel.jar;C:\apache-ant-1.8.2\lib\ant-apache-bsf.jar;C:\apache-ant-1.8.2\lib\ant-apache-log4j.jar;C:\apache-ant-1.8.2\lib\ant-apache-oro.jar;C:\apache-ant-1.8.2\lib\ant-apache-regexp.jar;C:\apache-ant-1.8.2\lib\ant-apache-resolver.jar;C:\apache-ant-1.8.2\lib\ant-apache-xalan2.jar;C:\apache-ant-1.8.2\lib\ant-commons-logging.jar;C:\apache-ant-1.8.2\lib\ant-commons-net.jar;C:\apache-ant-1.8.2\lib\ant-jai.jar;C:\apache-ant-1.8.2\lib\ant-javamail.jar;C:\apache-ant-1.8.2\lib\ant-jdepend.jar;C:\apache-ant-1.8.2\lib\ant-jmf.jar;C:\apache-ant-1.8.2\lib\ant-jsch.jar;C:\apache-ant-1.8.2\lib\ant-junit.jar;C:\apache-ant-1.8.2\lib\ant-junit4.jar;C:\apache-ant-1.8.2\lib\ant-launcher.jar;C:\apache-ant-1.8.2\lib\ant-netrexx.jar;C:\apache-ant-1.8.2\lib\ant-swing.jar;C:\apache-ant-1.8.2\lib\ant-testutil.jar;C:\apache-ant-1.8.2\lib\ant.jar;c:\jdk1.7.0_45_x32\lib\tools.jar, user.name=jogamp, java.vm.specification.version=1.7, sun.java.command=org.apache.tools.ant.launch.Launcher -Dlabel win7-x86_32-amd -Djocl.basename jocl -Djogl.basename jogl -Dgluegen.basename gluegen -Dgluegen.root ../../../gluegen/label/win7-x86_32-amd -Djocl.build.id 2013-11-01_20-56-20 -Djocl.build.number 873 -Djocl.build.commit cb27127c0be28cc1c864bcf5b6c94b860d3590d2 -Djogl.root ../../../jogl/label/win7-x86_32-amd -Djocl.build.branch origin/master -v clean-jar-test, java.home=c:\jdk1.7.0_45_x32\jre, sun.arch.data.model=32, user.language=en, java.specification.vendor=Oracle Corporation, awt.toolkit=sun.awt.windows.WToolkit, java.vm.info=mixed mode, java.version=1.7.0_45, java.ext.dirs=c:\jdk1.7.0_45_x32\jre\lib\ext;C:\Windows\Sun\Java\lib\ext, sun.boot.class.path=c:\jdk1.7.0_45_x32\jre\lib\resources.jar;c:\jdk1.7.0_45_x32\jre\lib\rt.jar;c:\jdk1.7.0_45_x32\jre\lib\sunrsasign.jar;c:\jdk1.7.0_45_x32\jre\lib\jsse.jar;c:\jdk1.7.0_45_x32\jre\lib\jce.jar;c:\jdk1.7.0_45_x32\jre\lib\charsets.jar;c:\jdk1.7.0_45_x32\jre\lib\jfr.jar;c:\jdk1.7.0_45_x32\jre\classes, java.vendor=Oracle Corporation, file.separator=\, java.vendor.url.bug=http://bugreport.sun.com/bugreport/, sun.io.unicode.encoding=UnicodeLittle, sun.cpu.endian=little, sun.desktop=windows, sun.cpu.isalist=pentium_pro+mmx pentium_pro pentium+mmx pentium i486 i386 i86}
    [junit] Testsuite: com.jogamp.opencl.util.concurrent.CLMultiContextTest
    [junit] Tests run: 1, Failures: 0, Errors: 1, Time elapsed: 0 sec
    [junit] 
    [junit] Testcase: com.jogamp.opencl.util.concurrent.CLMultiContextTest:createMultiContextTest:	Caused an ERROR
    [junit] Forked Java VM exited abnormally. Please note the time in the report does not reflect the time until the VM exit.
    [junit] junit.framework.AssertionFailedError: Forked Java VM exited abnormally. Please note the time in the report does not reflect the time until the VM exit.
    [junit] 
    [junit] 
    [junit] Test com.jogamp.opencl.util.concurrent.CLMultiContextTest FAILED (crashed)
Override ignored for property "tests.failed"
Override ignored for property "tests.failed"

junit.run.remote.ssh:
Skipped because property 'isCrosscompilation' not set.

junit.run.tests:
  [antcall] Exiting c:\JogAmpSlavex32\workspace\jocl\label\win7-x86_32-amd\build.xml.

junit.run.if.disabled:
Skipped because property 'junit.is.disabled' not set.

-do-test-run:

test-report:

-post-test-run:
   [delete] Could not find file c:\JogAmpSlavex32\workspace\jocl\label\win7-x86_32-amd\build\jocl-2.1-b873-20131101-windows-i586-test-results-win64-amd58xx-win7-jogamp-x32-c3d-001.7z to delete.
     [exec] Current OS is Windows 7
     [exec] Executing '7z' with arguments:
     [exec] 'a'
     [exec] '-r'
     [exec] 'c:\JogAmpSlavex32\workspace\jocl\label\win7-x86_32-amd\build\jocl-2.1-b873-20131101-windows-i586-test-results-win64-amd58xx-win7-jogamp-x32-c3d-001.7z'
     [exec] 'build/test/results/**'
     [exec] 
     [exec] The ' characters around the executable and arguments are
     [exec] not part of the command.
     [exec] 
     [exec] 7-Zip [64] 9.20  Copyright (c) 1999-2010 Igor Pavlov  2010-11-18
     [exec] Scanning
     [exec] 
     [exec] Creating archive c:\JogAmpSlavex32\workspace\jocl\label\win7-x86_32-amd\build\jocl-2.1-b873-20131101-windows-i586-test-results-win64-amd58xx-win7-jogamp-x32-c3d-001.7z
     [exec] 
     [exec] Compressing  build\test\results\TEST-com.jogamp.opencl.CLBufferTest.xml
     [exec] Compressing  build\test\results\TEST-com.jogamp.opencl.CLCommandQueueTest.xml
     [exec] Compressing  build\test\results\TEST-com.jogamp.opencl.CLExceptionTest.xml
     [exec] Compressing  build\test\results\TEST-com.jogamp.opencl.CLImageTest.xml
     [exec] Compressing  build\test\results\TEST-com.jogamp.opencl.CLProgramTest.xml
     [exec] Compressing  build\test\results\TEST-com.jogamp.opencl.gl.CLGLTest.xml
     [exec] Compressing  build\test\results\TEST-com.jogamp.opencl.HighLevelBindingTest.xml
     [exec] Compressing  build\test\results\TEST-com.jogamp.opencl.LowLevelBindingTest.xml
     [exec] Compressing  build\test\results\TEST-com.jogamp.opencl.util.concurrent.CLMultiContextTest.xml
     [exec] 
     [exec] Everything is Ok

-test-browse:
Skipped because property 'netbeans.home+have.tests' not set.

test:

jar-test:
  [antcall] Exiting c:\JogAmpSlavex32\workspace\jocl\label\win7-x86_32-amd\build.xml.

BUILD SUCCESSFUL
Total time: 39 seconds
[WARNINGS] Parsing warnings in console log with parser GNU Compiler 3 (gcc)
[WARNINGS] Parsing warnings in console log with parser Java Compiler (javac)
Archiving artifacts
Recording test results
Build step 'Publish JUnit test result report' changed build result to UNSTABLE
[CopyArchiverPublisher] Copying archived artifacts in the shared directory '/srv/www/jogamp.org/deployment/autobuilds/origin/master/jocl-b873-2013-11-01_20-56-20'.
[CopyArchiverPublisher] '2' artifacts have been copied.
[CopyArchiverPublisher] Stop copying archived artifacts in the shared directory.
No emails were triggered.
Notifying upstream projects of job completion
Finished: UNSTABLE